program: Gaussian 09
title: 000137202
version: EM64L-G09RevD.01
frameworkgroup: C1[X(C5H9ClO)]
method: RPBEPBE
basis: SDD
operation: Freq
keyword: #p
keyword: freq=noraman
keyword: PBEPBE/SDD
title: #p freq=noraman PBEPBE/SDD
converged: NO NO NO NO
title: Mulliken charges:
elementType: Cl O C C C C C H H H H H H H H H
charge: -0.100044 -0.244026 -0.361928 -0.365034 -0.365030 -0.298862 -0.298862 0.287097 0.215752 0.231481 0.231480 0.215751 0.204242 0.221870 0.221870 0.204242
chargesum: 0.00000
title: Mulliken charges with hydrogens summed into heavy atoms:
elementType: Cl O C C C C C
charge: -0.100044 -0.244026 -0.074831 0.082199 0.082201 0.127250 0.127250
polarizability: 6.56745274e+01 -4.85313232e-05 6.24649465e+01 5.74752094e+00 -3.70035032e-05 5.89313327e+01
1716.lowfreq: -17.8116 -5.9033 -0.0026 -0.0019 0.0013 18.6794 130.3900 185.0379 282.5770
frequency: 130.2737 185.0095 282.5747 323.7942 371.4445 465.6697 469.0087 526.3456 700.7951 783.9595 796.7327 847.3335 871.7398 1000.9666 1004.6297 1019.7426 1025.7833 1074.9801 1118.3245 1170.0037 1197.6165 1198.5260 1252.1080 1279.9099 1304.1539 1337.8500 1348.1231 1352.2328 1373.1628 1427.1804 1439.3220 1456.4006 1465.5111 2958.9680 2960.9190 2983.6036 2987.7171 3059.6952 3061.5673 3078.2454 3080.7516 3084.7566
redmass: 6.3923 2.7649 3.4132 2.0724 1.9419 3.2308 5.7941 2.6102 2.4622 4.2110 1.5596 3.2827 2.6409 1.4729 2.1661 2.2293 3.3799 1.6134 1.9398 1.1035 1.2445 1.4778 1.2762 1.1816 1.4829 1.3187 1.5074 1.3417 1.2620 1.0872 1.0869 1.0778 1.0905 1.0674 1.0674 1.0618 1.0617 1.0982 1.0995 1.0898 1.0973 1.0985
irintensity: 3.8441 4.9917 11.1085 0.0980 1.1856 0.0653 15.9859 15.3805 26.9540 6.9901 0.6965 10.8892 0.0134 4.2891 13.0558 22.8712 66.0257 9.8620 0.9783 1.3142 6.5115 29.4845 23.3703 1.1173 0.5201 4.4848 9.8050 3.5759 0.0387 11.9014 14.6317 4.1484 9.4982 35.9023 57.8331 6.1410 33.4402 35.3674 18.2437 28.0848 32.0993 23.2262
temp: 298.150 k
press: 1.00000 atm
elementType: 17 8 6 6 6 6 6 1 1 1 1 1 1 1 1 1
symmnumber: 1
zpe: 352045.6 jmol-1
zpe.correction: 0.134087 hartree
zpe.thermalcorrener: 0.140800 hartree
zpe.thermalcorrenthalpy: 0.141745 hartree
zpe.thermalcorrgfe: 0.103048 hartree
zpe.sumelectzpe: -730.633449 hartree
zpe.sumelectthermal: -730.626736 hartree
zpe.sumelectthermalent: -730.625792 hartree
zpe.sumelectthermalfe: -730.664488 hartree
dipole: 0.0087 0.0000 1.8512
dipole: 1.8512
quadrupole: -59.7172 -44.6310 -47.5233
quadrupole: 0.0000 -0.4272 0.0000
quadrupole: -9.0934 5.9929 3.1005 0.0000 -0.4272 0.0000
hfenergy: -730.7675364 hartree
pointgroup: C01 [X(C5H9Cl1O1)]
dipole: -0.1256918 0.0000252 0.7174026 debye
dipolederiv: -0.4332317 0.0000161 -0.207334 0.0000149 -0.2596369 0.0000193 -0.2769105 0.0000278 -0.4785089 -0.4953387 -0.0000324 0.087717 -0.0000333 -0.8323049 -0.0000008 0.0785848 0.0000014 -0.4503916 0.5096514 -0.0000219 0.3246947 -0.0000221 0.2755227 -0.0000323 0.4295721 -0.0000447 0.5825169 -0.097449 0.0004679 0.0333743 -0.0380505 -0.0673981 0.0071014 0.0111474 -0.0252206 -0.0563215 -0.0974448 -0.0004519 0.0333665 0.0380647 -0.0674056 -0.0071072 0.0111445 0.0252227 -0.0563261 0.3423833 -0.2188379 0.0116907 -0.1016555 0.5396441 -0.024159 -0.0563491 -0.0366358 0.3529228 0.3424554 0.2188768 0.0116868 0.1016931 0.5395745 0.0241486 -0.0563458 0.0366374 0.3529195 -0.0936939 0.000017 0.0477889 0.000016 0.0497893 -0.0000083 0.0333095 -0.0000063 -0.0918334 0.0214366 -0.0450916 -0.094215 -0.0492734 0.0819044 -0.0045615 -0.0400615 -0.0090953 -0.1164745 0.0007659 0.1248111 0.0098329 0.0853473 -0.0881173 0.0068484 0.006515 0.0340166 0.0958345 0.0007185 -0.1248328 0.0098401 -0.0853677 -0.0880762 -0.0068404 0.0065155 -0.0340073 0.0958382 0.021457 0.0450994 -0.0942175 0.0492851 0.0818856 0.0045707 -0.0400623 0.0090913 -0.1164746 0.0227709 0.0971052 -0.0940329 0.0334449 0.0179872 -0.0296863 -0.0409778 0.054895 -0.1464461 -0.0336339 -0.110314 0.0069174 -0.0904512 -0.1006708 -0.0014012 -0.0125484 -0.0313425 0.0895947 -0.0335884 0.1102985 0.0069135 0.0904352 -0.1007133 0.0014076 -0.0125445 0.0313526 0.089594 0.0227415 -0.0971095 -0.0940236 -0.0334473 0.0180153 0.029701 -0.040989 -0.0548924 -0.1464439 unknown
polarizability: 63.458295|0.0000009|62.4649465|6.5625298|-0.0008154|61.1475652 unknown
InChI: InChI=1S/C5H9ClO/c6-5-1-3-7-4-2-5/h5H,1-4H2
charge 0 multiplicity 1
16 atoms
Cl -2.0975 0.000211 -1.013063
O  1.765627 -0.0002 -0.200446
C  -1.060206 0.000125 0.607896
C  -0.200323 1.275357 0.650202
C  -0.2006 -1.275278 0.650261
C  0.948062 1.215177 -0.378123
C  0.947794 -1.215407 -0.378068
H  -1.841836 0.00023 1.383476
H  0.230964 1.34681 1.669555
H  -0.824212 2.171576 0.478954
H  -0.824687 -2.171372 0.479077
H  0.230678 -1.346767 1.669619
H  0.531966 1.244817 -1.408407
H  1.649371 2.054855 -0.243035
H  1.648917 -2.055237 -0.242951
H  0.531684 -1.244997 -1.408348
