program: Gaussian 09
title: 000137191
version: EM64L-G09RevD.01
frameworkgroup: C1[X(C16H13N)]
method: RPBEPBE
basis: SDD
operation: Freq
keyword: #pfreq=noraman
keyword: PBEPBE/SDD
title: #p freq=noraman PBEPBE/SDD
converged: YES YES NO NO
title: Mulliken charges:
elementType: N C C C C C C C C C C C C C C C C H H H H H H H H H H H H H
charge: -0.031751 -0.666227 0.138400 0.500516 0.428012 -0.109736 -0.311179 -0.307010 -0.391614 -0.443384 -0.380734 -0.325220 -0.250404 -0.222548 -0.223234 -0.223151 -0.248271 0.250739 0.218075 0.242864 0.241829 0.233640 0.230997 0.247646 0.263253 0.229542 0.231610 0.224645 0.225035 0.227658
chargesum: 0.00000
title: Mulliken charges with hydrogens summed into heavy atoms:
elementType: N C C C C C C C C C C C C C C C C
charge: -0.031751 -0.197413 0.138400 0.500516 0.428012 -0.109736 -0.068315 -0.065180 -0.157974 -0.212387 -0.133088 -0.061967 -0.020862 0.009063 0.001412 0.001884 -0.020613
polarizability: 2.68841238e+02 -2.69854134e+01 1.44557904e+02 1.57357686e+01 -1.23640824e-01 1.23017815e+02
1716.lowfreq: -7.9955 -2.3588 -0.0005 -0.0004 0.0006 10.3700 16.5130 24.4880 47.3309
frequency: 16.0592 24.4693 47.3190 117.1569 172.6354 188.5383 228.7509 283.7412 317.6858 396.2148 404.6849 409.6627 453.1903 479.8060 506.8763 511.1597 518.6868 591.1969 613.0179 618.8263 670.6186 703.8705 718.6526 748.9982 758.3974 773.2546 796.1057 816.0017 849.1534 855.3992 874.0480 888.1059 915.8001 932.8564 956.5347 965.1782 978.4499 988.2991 990.5414 995.8627 996.5166 1017.1205 1027.0028 1080.4533 1109.4027 1145.7758 1159.6415 1166.0676 1171.7416 1187.4843 1205.3941 1225.3863 1237.7025 1266.2069 1283.6532 1305.4052 1332.2326 1366.4610 1383.0174 1404.1881 1419.7478 1440.5003 1456.0821 1460.1409 1483.6696 1503.1347 1551.5284 1592.8514 1595.9389 1614.0343 1624.9182 2990.3134 3054.7808 3113.3006 3119.8656 3120.5391 3125.7657 3133.1269 3135.6029 3143.9554 3153.9612 3155.3760 3161.9450 3169.2320
redmass: 4.5589 3.8661 4.9750 4.8292 4.2006 4.6512 4.4621 5.0687 2.4193 3.4925 2.8188 3.1524 3.8957 3.0005 4.2297 4.2445 6.1785 4.2635 6.9868 6.4486 4.0082 2.4316 1.8576 4.1495 1.4297 2.5205 3.0923 2.4665 1.6499 1.2532 3.5816 1.7200 1.7837 2.4757 2.5381 1.3645 1.3862 1.4717 4.7772 1.3196 1.3328 2.1597 2.2071 1.5928 1.8093 1.2567 1.2030 1.1040 1.0579 1.1152 2.5574 1.7818 2.1866 1.8284 2.1556 2.0936 1.3112 3.7559 7.2058 4.9466 2.1903 2.1055 1.1384 3.0396 2.2462 3.4993 7.3212 6.1878 6.2788 6.1128 6.6788 1.0614 1.0990 1.0873 1.0872 1.0863 1.0884 1.0913 1.0891 1.0961 1.0950 1.0974 1.1015 1.0994
irintensity: 0.2265 0.0864 0.8134 0.8956 5.4259 1.0089 1.3506 0.7161 2.4637 1.4118 0.1812 4.7120 5.6590 9.3293 8.1475 1.4941 0.5588 4.4544 3.3649 0.6311 1.0134 21.7925 59.2889 12.5356 39.9199 23.3643 11.6522 20.8737 48.7384 0.3593 3.0181 3.4515 1.1343 2.3064 3.1490 3.4990 0.0570 1.3530 0.7228 0.3480 0.0741 7.2157 9.1614 11.6695 10.6438 1.6869 7.4855 1.5145 0.2033 1.5506 0.7055 3.6716 6.5932 3.1632 7.6591 6.2522 1.6914 9.8885 1.4664 4.0663 13.8381 5.6508 17.3541 4.8646 23.7852 37.6673 23.3202 10.7319 39.1733 7.9210 9.8194 21.2774 5.8760 9.3174 3.0631 1.7937 7.5391 12.4146 12.0564 41.1309 26.7919 16.6431 28.0687 23.4734
temp: 298.150 k
press: 1.00000 atm
elementType: 7 6 6 6 6 6 6 6 6 6 6 6 6 6 6 6 6 1 1 1 1 1 1 1 1 1 1 1 1 1
symmnumber: 1
zpe: 630832.6 jmol-1
zpe.correction: 0.240271 hartree
zpe.thermalcorrener: 0.253286 hartree
zpe.thermalcorrenthalpy: 0.254230 hartree
zpe.thermalcorrgfe: 0.198231 hartree
zpe.sumelectzpe: -671.107129 hartree
zpe.sumelectthermal: -671.094115 hartree
zpe.sumelectthermalent: -671.093170 hartree
zpe.sumelectthermalfe: -671.149170 hartree
dipole: 0.4049 1.8525 0.7437
dipole: 2.0368
quadrupole: -85.2853 -94.1328 -97.8852
quadrupole: -2.4725 3.4723 -1.8235
quadrupole: 7.1491 -1.6984 -5.4507 -2.4725 3.4723 -1.8235
hfenergy: -671.3474009 hartree
pointgroup: C01[X(C16H13N1)]
dipole: 0.2094882 0.5014997 0.5888863 debye
polarizability: 264.3643643|-38.8364759|144.5836394|-2.0308916|9.7875791|127.468953 unknown
InChI: InChI=1S/C16H13N/c1-2-6-13(7-3-1)12-15-11-10-14-8-4-5-9-16(14)17-15/h1-11H,12H2
charge 0 multiplicity 1
30 atoms
N  0.918424 -0.442431 -1.196457
C  -1.359273 0.420509 -1.498464
C  -0.00815 0.452595 -0.793387
C  -2.534403 0.164317 -0.555825
C  2.500985 0.505788 0.477395
C  2.165637 -0.428527 -0.577506
C  0.241822 1.408687 0.254286
C  1.485605 1.436011 0.879654
C  3.805556 0.461358 1.065264
C  -3.619972 1.071488 -0.473408
C  -2.561839 -1.003233 0.251649
C  3.147461 -1.376858 -1.006615
C  4.746382 -0.474633 0.626759
C  4.414143 -1.39865 -0.415208
C  -4.710584 0.820577 0.391956
C  -3.6484 -1.257407 1.115977
C  -4.728203 -0.345286 1.190287
H  -1.298073 -0.37099 -2.267013
H  -1.5200 1.380601 -2.026706
H  -0.557988 2.095756 0.548871
H  1.699089 2.157378 1.677456
H  4.056014 1.170472 1.863895
H  -3.614334 1.976923 -1.09358
H  -1.726311 -1.71177 0.198037
H  2.869056 -2.071552 -1.805115
H  5.74384 -0.506157 1.078768
H  5.162138 -2.126527 -0.7485
H  -5.54292 1.532049 0.441314
H  -3.655516 -2.164769 1.730853
H  -5.572085 -0.542118 1.861062
