program: Gaussian 09
title: 000137166
version: EM64L-G09RevD.01
frameworkgroup: C1[X(C9H13NO)]
method: RPBEPBE
basis: SDD
operation: Freq
keyword: #p
keyword: freq=noraman
keyword: PBEPBE/SDD
title: #p freq=noraman PBEPBE/SDD
converged: YES YES NO NO
title: Mulliken charges:
elementType: O N C C C C C C C C C H H H H H H H H H H H H H
charge: -0.446986 -0.154687 0.407513 0.379191 -0.345158 -0.347284 -0.356963 -0.439494 -0.646571 -0.646644 -0.448470 0.235566 0.235006 0.246401 0.224947 0.233212 0.215457 0.233533 0.215781 0.232339 0.233006 0.188877 0.218237 0.333189
chargesum: 0.00000
title: Mulliken charges with hydrogens summed into heavy atoms:
elementType: O N C C C C C C C C C
charge: -0.113797 -0.154687 0.407513 0.379191 -0.109592 -0.112278 -0.110561 -0.214547 0.035631 0.034482 -0.041356
polarizability: 1.65377214e+02 -9.53556231e-01 1.06011402e+02 4.47786607e+00 1.13941893e+00 6.44181060e+01
1716.lowfreq: -13.9758 -5.7845 -0.0009 -0.0006 -0.0003 11.1040 33.2243 71.3072 76.3957
frequency: 32.8670 71.2794 76.3760 102.6787 161.2830 201.1405 206.4030 256.3404 304.5784 336.9552 365.4949 415.0816 434.8066 474.7047 505.3601 552.4957 634.9393 684.7454 727.7005 795.6195 804.8954 817.8382 920.6687 938.6277 945.0848 950.0777 969.6760 998.8607 1057.1113 1108.9208 1109.7096 1127.4800 1156.1827 1165.0768 1195.6030 1234.4277 1263.6152 1284.0777 1326.3390 1358.7461 1369.1426 1387.3415 1425.0719 1437.6956 1459.0309 1463.3202 1473.5406 1473.7876 1493.6097 1506.9278 1529.6410 1566.5356 1633.3254 2933.8216 2942.5184 2956.6891 2997.4383 3000.8422 3049.4377 3093.8752 3103.4624 3109.6774 3128.9213 3159.9812 3164.1094 3550.6595
redmass: 3.6371 3.4284 2.4013 1.8007 2.3311 1.1356 2.2889 2.7344 1.7685 3.9066 1.5571 3.0289 3.6963 3.3765 2.8332 2.8956 6.9648 3.4409 3.7319 3.2150 1.2899 2.2088 1.8194 2.5574 3.2043 1.3518 1.6293 2.9575 1.4912 1.2855 1.2696 1.4033 1.1074 1.7222 1.1737 2.3062 2.8962 1.2928 1.3722 3.0817 1.4397 3.3105 1.7829 1.6442 1.2062 1.0467 1.0929 1.0485 1.0849 1.1160 2.6185 6.5823 6.2054 1.0371 1.0397 1.0676 1.0994 1.1025 1.0955 1.0956 1.0936 1.0894 1.0885 1.0928 1.0941 1.0661
irintensity: 2.0806 4.4096 0.5361 2.4863 2.3018 0.0136 1.7883 0.4038 60.7566 1.1439 128.6242 1.7506 9.9544 3.0609 8.5690 24.0661 0.3204 9.0639 1.0577 45.2230 0.5337 45.9237 50.8076 62.9172 8.1677 0.5141 1.1451 0.8068 28.1374 0.6422 0.4494 8.0367 14.0145 10.5758 39.1931 11.2096 34.6154 13.1842 11.1002 158.1220 19.0736 19.2029 5.0453 0.4563 8.9079 0.5380 1.9442 22.7951 1.9303 27.9245 205.3919 10.3316 190.8579 116.9498 83.5929 77.7973 11.8134 85.9368 28.9261 4.8367 48.4083 17.2978 8.8182 28.3474 7.5258 3.5742
temp: 298.150 k
press: 1.00000 atm
elementType: 8 7 6 6 6 6 6 6 6 6 6 1 1 1 1 1 1 1 1 1 1 1 1 1
symmnumber: 1
zpe: 529253.5 jmol-1
zpe.correction: 0.201582 hartree
zpe.thermalcorrener: 0.213302 hartree
zpe.thermalcorrenthalpy: 0.214246 hartree
zpe.thermalcorrgfe: 0.163249 hartree
zpe.sumelectzpe: -479.871105 hartree
zpe.sumelectthermal: -479.859384 hartree
zpe.sumelectthermalent: -479.858440 hartree
zpe.sumelectthermalfe: -479.909438 hartree
dipole: 4.6071 0.9103 0.4054
dipole: 4.7136
quadrupole: -67.4749 -61.2068 -67.5345
quadrupole: -5.3290 1.0894 1.0788
quadrupole: -2.0695 4.1986 -2.1291 -5.3290 1.0894 1.0788
hfenergy: -480.0726866 hartree
pointgroup: C01 [X(C9H13N1O1)]
dipole: 1.7946565 -0.451424 -0.1203608 debye
dipolederiv: -0.9034994 -0.0623741 -0.2091486 -0.026807 -0.406131 0.1778758 -0.3873316 0.1947196 -0.4985694 -1.7129109 -0.0095384 0.0996927 -0.0074879 -0.5383365 0.0214252 0.1424157 0.0225293 -0.3054772 1.6888595 0.0189605 -0.1212266 0.0364885 -0.1165628 0.0232161 -0.1475716 0.0244042 0.136881 -0.385574 -0.0072242 -0.046368 -0.0746649 -0.2928475 0.0635741 0.00018 0.0275956 -0.1680351 -0.4771157 -0.0735688 0.0143706 0.3908273 0.0211525 -0.0512042 -0.0196986 -0.0241177 -0.2340442 -0.4974727 0.0718946 -0.0011866 -0.434247 0.006963 0.0099234 0.0684046 -0.0301098 -0.2383518 0.2394151 0.1219858 -0.030062 0.0476715 0.1728029 -0.020305 0.0180586 -0.0277146 -0.1382286 0.2744831 -0.1422772 -0.0215826 -0.061555 0.1728689 -0.0375165 -0.0711316 -0.0213067 -0.1470025 0.2810023 0.1620351 -0.0125666 0.4310599 0.4897088 -0.0487782 -0.0413299 -0.0323959 0.2681541 0.2989588 -0.1683381 0.0157831 -0.4377194 0.4796706 0.0092098 0.0339741 -0.0068507 0.261525 0.7915552 -0.0030709 0.1027905 0.0178409 0.3665569 -0.1177328 0.1984637 -0.1278522 0.546838 0.0240092 -0.0958098 0.0188253 -0.0938729 -0.0556342 0.025969 0.0155133 0.0298124 0.1577959 0.0187082 0.0988416 0.0021246 0.0992129 -0.0548801 0.011538 0.0063153 0.0091899 0.1661955 0.0467975 0.0874567 0.0082783 0.0854102 -0.0430626 0.0066001 0.0071878 0.0072984 0.1449121 0.0183455 -0.1093227 0.021388 -0.0974766 -0.0693357 0.0264432 0.0196623 0.028454 0.1394008 0.085744 0.0613293 -0.0913784 -0.1060477 -0.0660826 0.1029749 0.0110967 0.1252832 -0.107467 -0.1763687 0.0021948 0.0250691 0.0954408 0.0895484 -0.0066043 0.0177387 0.0015624 0.1142991 0.0935549 0.0486103 0.0493281 -0.1281372 -0.1056806 -0.0873272 -0.0257625 -0.1375577 -0.0803203 -0.1723115 -0.0055053 0.0260091 -0.0988732 0.0886484 0.012243 0.0355943 0.0037518 0.1122533 0.0836742 -0.072311 -0.0763647 0.1118017 -0.1071879 -0.1063024 -0.003226 -0.1258239 -0.0674591 0.0895899 -0.0346079 0.0536428 0.127959 -0.0641325 0.086582 -0.0541216 0.134493 -0.1210459 -0.0005448 -0.0183414 -0.0190116 -0.1200916 -0.1982213 0.1075823 -0.009349 0.0524185 0.0110838 -0.0771949 0.0295449 0.0476689 0.1263398 0.0190341 -0.1102135 0.0281161 -0.0488539 -0.0742603 0.3682954 0.0994365 0.1439244 0.1169279 0.2111409 -0.0991727 0.1568013 -0.0789293 0.1209227 unknown
polarizability: 165.2200481|-2.1940885|105.5505742|-5.548916|-4.6238001|65.0360999 unknown
InChI: InChI=1S/C9H13NO/c1-10(2)9-5-3-8(7-11)4-6-9/h3-6,11H,7H2,1-2H3
charge 0 multiplicity 1
24 atoms
O  -3.941338 0.569601 -0.712224
N  2.523866 -0.033466 -0.097861
C  1.129802 -0.047522 0.029662
C  -1.743342 -0.070286 0.296766
C  0.368619 1.167134 -0.00715
C  0.410601 -1.273071 0.200112
C  -1.030303 1.145582 0.125077
C  -0.992706 -1.271126 0.326524
C  3.234316 1.238968 -0.268829
C  3.277184 -1.29109 -0.046798
C  -3.252852 -0.077211 0.43042
H  0.872076 2.129158 -0.138286
H  0.944009 -2.227278 0.232574
H  -1.589375 2.08834 0.088584
H  -1.514344 -2.228885 0.454444
H  2.914278 1.770848 -1.188534
H  4.31597 1.046851 -0.349573
H  3.074105 1.921969 0.590877
H  4.351777 -1.080713 -0.16648
H  2.975164 -1.986793 -0.856821
H  3.139072 -1.817206 0.920619
H  -3.616671 -1.11824 0.56484
H  -3.593429 0.520433 1.294354
H  -3.54928 0.209805 -1.548697
