program: Gaussian 09
title: 000137144
version: EM64L-G09RevD.01
frameworkgroup: C1[X(C8H7N3O2)]
method: RPBEPBE
basis: SDD
operation: Freq
keyword: #pfreq=noraman
keyword: PBEPBE/SDD
title: #p freq=noraman PBEPBE/SDD
converged: NO YES NO YES
title: Mulliken charges:
elementType: O O N N N C C C C C C C C H H H H H H H
charge: -0.264218 -0.264224 -0.426985 -0.676414 -0.676412 0.036589 0.036591 0.331557 0.331553 0.113462 0.113458 -0.388596 -0.388593 0.339327 0.222823 0.222822 0.307468 0.361161 0.361162 0.307468
chargesum: 0.00000
title: Mulliken charges with hydrogens summed into heavy atoms:
elementType: O O N N N C C C C C C C C
charge: -0.264218 -0.264224 -0.087657 -0.007784 -0.007782 0.036589 0.036591 0.331557 0.331553 0.113462 0.113458 -0.165773 -0.165771
polarizability: 1.63740038e+02 -8.00875062e-05 1.56895068e+02 1.22273332e-02 3.56011769e-03 4.58995209e+01
1716.lowfreq: -9.0630 0.0008 0.0009 0.0010 4.6991 8.4755 115.7748 141.5611 159.5062
frequency: 115.7748 141.5610 159.5062 185.8028 210.0855 262.7469 359.1387 361.8267 381.9211 386.9381 396.7461 437.7072 454.2254 518.5059 560.9100 602.0465 614.0676 622.2937 627.1419 638.3240 649.3425 665.4944 748.8493 753.8787 772.2872 813.9331 921.4947 942.1182 956.4940 1019.9209 1062.8399 1092.3238 1173.8658 1259.2090 1287.1994 1289.6748 1323.6976 1356.4712 1429.9881 1465.5348 1509.9349 1594.8476 1600.9303 1624.7756 1643.5869 1647.9576 1686.7541 3118.8857 3142.8463 3492.8883 3493.6098 3585.3504 3673.7044 3673.9412
redmass: 9.2489 4.6914 5.5901 5.6770 7.0935 4.1395 6.2712 5.1572 1.0957 1.1665 5.4722 6.3403 6.8769 4.3223 2.1076 9.5898 1.0911 1.1622 1.2877 7.7452 4.4158 5.9472 8.3932 5.0473 10.4294 1.6161 4.7759 1.3494 2.7388 4.2179 1.6355 2.1237 1.2385 3.0436 6.2796 1.6599 1.8438 6.1140 5.1522 7.8164 3.7383 2.7583 1.9073 5.6036 1.8184 2.3563 8.1381 1.0866 1.0965 1.0496 1.0501 1.0802 1.1003 1.1003
irintensity: 0.0000 1.3782 9.1371 2.8702 15.5818 17.8824 0.8771 0.0000 0.0006 257.4974 4.5553 0.0000 0.3211 7.1632 137.0728 2.0916 0.0002 317.3659 0.5429 58.8148 5.3946 0.0000 34.2556 0.4731 0.0000 55.0250 17.0337 0.0000 9.8617 97.6565 59.2997 2.6453 16.6637 41.8923 300.5918 0.0223 9.4243 100.7121 22.5541 14.2894 79.5831 298.6705 105.0694 821.7742 0.0288 193.3382 2.9516 11.4413 24.1028 139.9707 1.9560 74.5213 13.4932 79.9131
temp: 298.150 k
press: 1.00000 atm
elementType: 8 8 7 7 7 6 6 6 6 6 6 6 6 1 1 1 1 1 1 1
symmnumber: 1
zpe: 385866.9 jmol-1
zpe.correction: 0.146969 hartree
zpe.thermalcorrener: 0.157671 hartree
zpe.thermalcorrenthalpy: 0.158615 hartree
zpe.thermalcorrgfe: 0.111392 hartree
zpe.sumelectzpe: -622.902009 hartree
zpe.sumelectthermal: -622.891307 hartree
zpe.sumelectthermalent: -622.890363 hartree
zpe.sumelectthermalfe: -622.937586 hartree
dipole: 0.0000 -4.9561 0.0021
dipole: 4.9561
quadrupole: -68.7445 -64.2839 -78.5691
quadrupole: 0.0001 0.0080 0.0001
quadrupole: 1.7880 6.2486 -8.0366 0.0001 0.0080 0.0001
hfenergy: -623.0489782 hartree
pointgroup: C01 [X(C8H7N3O2)]
dipole: -0.000439 -1.9498785 -0.0008404 debye
dipolederiv: -1.0660473 0.6354325 -0.0000161 0.2497552 -0.7615332 -0.0000092 0.0000982 -0.0001049 -0.3611154 -1.0664186 -0.6352841 0.0000971 -0.2496132 -0.7611436 0.0000338 -0.0001674 -0.0001748 -0.3611173 -1.3442191 0.000171 -0.0000324 0.0001602 -0.6106118 0.0000388 -0.0000067 -0.000045 -0.3641364 -1.4652755 -0.4466008 -0.0000184 0.0429388 -0.0673007 -0.0000521 0.0002693 0.0000387 -0.6797723 -1.465099 0.4472099 -0.0001631 -0.0423277 -0.0674806 -0.0000246 -0.000197 0.0000712 -0.6797697 -0.1997379 0.5987978 -0.0000636 -0.2291683 -0.7829595 -0.0000511 -0.0000108 0.0000341 -0.0636686 -0.1998949 -0.599054 0.0000205 0.2289184 -0.7828005 0.0000578 -0.0000356 0.0000752 -0.0636653 1.4660524 0.4938239 0.0002191 -0.0425655 -0.3562837 0.0000341 0.0002653 0.0000894 0.1358958 1.4658571 -0.4946173 0.0002095 0.0417708 -0.3560859 -0.0000004 0.0001649 -0.0000061 0.1358944 1.4814173 -0.3645922 -0.0000516 0.2210763 1.5117575 0.0000348 -0.0001013 0.0001133 0.2313592 1.4814494 0.3645823 -0.0000601 -0.2210742 1.5116929 -0.0000822 0.0001088 0.0001126 0.2313515 -0.1497055 -0.4877801 0.0000378 0.2763906 0.3993874 0.0000156 -0.0000417 -0.0001426 -0.1729849 -0.1496127 0.4880187 -0.0000272 -0.2761514 0.3993003 -0.0000733 0.0000019 0.0000472 -0.1729839 0.1414408 0.0000188 0.0000075 0.0000224 0.2421058 -0.0000126 0.0000104 -0.0000142 0.3581173 0.0144468 -0.1189829 -0.0000181 -0.0771083 -0.0554283 -0.0000029 -0.0000362 -0.0000225 0.159008 0.0145328 0.1189526 -0.0000276 0.0770786 -0.0555169 0.0000273 -0.0000241 0.000024 0.1590077 0.2430208 0.0334677 -0.0000691 0.0235659 0.1576074 -0.0000002 -0.0002448 -0.0001175 0.3801551 0.2773898 -0.0292871 -0.0000355 -0.0079933 0.1388359 0.0000497 -0.0001276 0.000042 0.3741352 0.2774058 0.0292279 -0.0000048 0.0079288 0.1388233 0.0000207 0.000003 0.0000349 0.3741334 0.2429975 -0.0335045 -0.0000039 -0.0236037 0.1576342 -0.0000039 0.0000716 -0.000055 0.3801564 unknown
polarizability: 163.7400372|-0.0014015|156.8950682|0.0122266|-0.0035628|45.8995209 unknown
InChI: InChI=1S/C8H7N3O2/c9-3-1-2-4(10)6-5(3)7(12)11-8(6)13/h1-2,11H,9-10H2
charge 0 multiplicity 1
20 atoms
O  -2.373436 1.896654 0.000187
O  2.374243 1.895616 0.000181
N  0.000483 2.255947 -0.000015
N  -2.851213 -1.100581 -0.00043
N  2.85071 -1.101824 0.000418
C  -0.70983 0.063729 -0.000155
C  0.709834 0.06342 0.000018
C  -1.46763 -1.125635 -0.00017
C  1.467118 -1.126278 0.000257
C  -1.182415 1.460237 -0.000067
C  1.183024 1.45972 -0.000123
C  -0.701669 -2.347276 0.000099
C  0.70062 -2.347581 0.000309
H  0.000716 3.27638 0.000092
H  -1.231409 -3.307955 0.000077
H  1.229937 -3.308494 0.000445
H  -3.397778 -1.956726 -0.000756
H  -3.321113 -0.192555 -0.000946
H  3.320996 -0.193996 0.000365
H  3.39691 -1.958201 0.000414
