program: Gaussian 09
title: 000137141
version: EM64L-G09RevD.01
frameworkgroup: C1[X(C10H18O)]
method: RPBEPBE
basis: SDD
operation: Freq
keyword: #pfreq=noraman
keyword: PBEPBE/SDD
title: #p freq=noraman PBEPBE/SDD
converged: NO YES NO NO
title: Mulliken charges:
elementType: O C C C C C C C C C C H H H H H H H H H H H H H H H H H H
charge: -0.487363 0.360951 -0.068337 -0.526104 -0.526121 -0.447516 -0.447513 -0.375223 -0.375223 -0.409558 -0.409558 0.192451 0.203494 0.197831 0.197833 0.203499 0.223672 0.185381 0.185380 0.223672 0.190104 0.208789 0.208787 0.190104 0.202410 0.186127 0.186128 0.202410 0.323491
chargesum: 0.00000
title: Mulliken charges with hydrogens summed into heavy atoms:
elementType: O C C C C C C C C C C
charge: -0.163872 0.360951 0.124114 -0.124779 -0.124789 -0.038463 -0.038460 0.023670 0.023668 -0.021020 -0.021019
polarizability: 1.16527975e+02 3.39308735e-04 1.05116176e+02 -2.06743123e-04 3.54843162e-01 9.06576985e+01
1716.lowfreq: -24.6271 -20.1427 -4.6776 -0.0004 0.0007 0.0007 116.5650 135.6881 191.7385
frequency: 116.5381 135.6811 191.7349 222.5862 274.9930 283.7755 295.6410 303.6557 334.1173 395.2666 407.5503 410.1003 491.8095 503.8330 529.4555 581.9534 680.2171 777.9339 795.7185 834.4159 840.2100 856.4431 877.1375 898.8782 900.8209 939.4929 981.6499 986.0698 1012.2129 1031.6500 1045.6949 1084.1645 1088.8134 1106.0695 1127.6926 1138.0797 1139.5517 1151.9189 1162.8289 1188.3270 1227.8491 1247.5908 1258.5977 1267.9044 1282.9380 1314.6323 1330.5989 1333.6931 1335.0350 1335.6744 1342.3236 1344.2691 1347.7686 1350.0419 1373.7948 1446.6134 1451.2114 1454.5605 1458.1410 1460.7510 1465.2541 1468.6682 1471.9039 2929.8455 2944.7678 2952.1742 2955.8205 2956.5098 2973.9221 2978.5297 2980.7999 2981.8788 2999.9917 3009.6288 3020.7377 3022.2697 3034.9240 3039.1446 3044.8758 3049.0564 3539.9422
redmass: 2.6691 2.5892 2.1807 3.5014 1.0447 2.0565 2.8953 2.3984 1.8281 3.7671 3.1028 2.0640 2.3634 1.8343 2.5786 2.1461 3.5269 2.1405 1.5045 1.6722 2.6981 2.3852 1.4888 2.0929 2.4014 1.5522 2.1877 1.8707 1.4587 2.3683 1.5375 1.4370 1.3878 2.0630 1.3946 2.2182 2.0696 1.4525 2.6163 1.3606 1.3422 1.3252 1.2494 1.3443 1.2080 1.4490 1.4400 1.4994 1.5028 1.3367 1.4569 1.5265 1.6269 1.4027 1.7214 1.0896 1.0911 1.0898 1.0969 1.0860 1.0826 1.0931 1.0951 1.0813 1.0604 1.0607 1.0626 1.0627 1.0618 1.0615 1.0633 1.0627 1.0986 1.0991 1.0964 1.0956 1.1024 1.1022 1.1030 1.1018 1.0658
irintensity: 1.1590 0.1925 1.2009 2.5188 122.0153 0.1945 15.2967 3.1423 3.4465 0.0219 0.0641 3.5620 5.4042 0.2567 6.1648 2.6815 1.1449 8.3308 1.4224 6.6966 12.4172 3.3217 0.0417 23.7006 0.0877 38.8891 12.4339 0.4559 6.6095 0.0010 8.1697 14.4803 0.1056 2.5781 1.8610 7.6637 7.1200 5.3873 2.2348 22.1966 0.0165 3.5298 0.6780 8.5828 0.8101 3.1185 5.8103 1.5936 0.0563 0.8335 1.7854 2.3673 0.0125 0.3370 7.7947 1.5191 2.0039 9.5453 14.3555 2.5791 24.9701 10.4772 0.8531 13.8483 5.7430 86.8917 30.0828 50.6229 0.0006 93.1910 49.2267 33.3323 8.0358 67.1988 104.2961 23.3577 14.5414 18.8824 0.3876 176.8445 2.5036
temp: 298.150 k
press: 1.00000 atm
elementType: 8 6 6 6 6 6 6 6 6 6 6 1 1 1 1 1 1 1 1 1 1 1 1 1 1 1 1 1 1
symmnumber: 1
zpe: 687310.3 jmol-1
zpe.correction: 0.261783 hartree
zpe.thermalcorrener: 0.272225 hartree
zpe.thermalcorrenthalpy: 0.273170 hartree
zpe.thermalcorrgfe: 0.227189 hartree
zpe.sumelectzpe: -466.201402 hartree
zpe.sumelectthermal: -466.190959 hartree
zpe.sumelectthermalent: -466.190015 hartree
zpe.sumelectthermalfe: -466.235995 hartree
dipole: -0.0002 -1.2326 -0.9509
dipole: 1.5568
quadrupole: -69.7444 -65.6220 -69.8245
quadrupole: 0.0003 -0.0003 -2.2511
quadrupole: -1.3474 2.7750 -1.4275 0.0003 -0.0003 -2.2511
hfenergy: -466.4631844 hartree
pointgroup: C01 [X(C10H18O1)]
dipole: -0.0000635 -0.4871826 -0.371201 debye
polarizability: 116.5279746|0.000646|105.1199097|-0.0003658|0.2681719|90.6539648 unknown
InChI: InChI=1S/C10H18O/c11-10-7-3-1-5-9(10)6-2-4-8-10/h9,11H,1-8H2
charge 0 multiplicity 1
29 atoms
O  0.000031 -0.764861 1.525015
C  0.000021 -0.680965 0.036146
C  -0.000016 0.839593 -0.29404
C  1.281717 -1.358908 -0.51333
C  -1.281648 -1.358979 -0.513304
C  1.288339 1.52202 0.223389
C  -1.288404 1.521958 0.223394
C  2.569186 -0.670756 -0.004284
C  -2.569147 -0.670881 -0.004252
C  2.559948 0.840938 -0.335268
C  -2.55998 0.840809 -0.335252
H  -0.00002 0.903319 -1.406213
H  1.254471 -1.32155 -1.622065
H  1.278229 -2.433906 -0.232141
H  -1.278096 -2.433968 -0.232091
H  -1.254416 -1.321637 -1.622038
H  1.29544 1.468008 1.329291
H  1.270938 2.594737 -0.055841
H  -1.271061 2.594674 -0.055847
H  -1.295489 1.467956 1.329294
H  3.45817 -1.159272 -0.44968
H  2.637054 -0.79821 1.093709
H  -2.637019 -0.798333 1.09374
H  -3.458111 -1.159445 -0.449644
H  3.466621 1.32533 0.0773
H  2.596394 0.975716 -1.437365
H  -2.596429 0.975567 -1.437349
H  -3.466672 1.325167 0.077314
H  -0.000052 -1.724321 1.777314
