program: Gaussian 09
title: 000137333
version: EM64L-G09RevD.01
frameworkgroup: C1[X(C16H23NO2)]
method: RPBEPBE
basis: SDD
operation: Freq
keyword: #p
keyword: freq=noraman
keyword: PBEPBE/SDD
title: #p freq=noraman PBEPBE/SDD
converged: YES YES NO NO
title: Mulliken charges:
elementType: O O N C C C C C C C C C C C C C C C C H H H H H H H H H H H H H H H H H H H H H H H
charge: -0.429581 -0.438021 -0.102026 -0.032531 -0.159918 -0.464150 -0.515098 -0.416014 0.380231 -0.374483 -0.593024 0.081834 -0.305252 -0.616803 0.164553 -0.402728 0.335146 -0.551950 -0.696604 0.180377 0.229843 0.208160 0.215154 0.231020 0.213185 0.196477 0.206310 0.170153 0.218098 0.208731 0.232253 0.203943 0.166411 0.210633 0.205294 0.215680 0.273009 0.210336 0.208442 0.221000 0.361339 0.350574
chargesum: 0.00000
title: Mulliken charges with hydrogens summed into heavy atoms:
elementType: O O N C C C C C C C C C C C C C C C C
charge: -0.068242 -0.087448 -0.102026 0.147846 0.069926 -0.040836 -0.070893 -0.013227 0.380231 0.013768 -0.152040 0.081834 0.065101 -0.406171 0.164553 0.018245 0.335146 -0.278941 -0.056826
polarizability: 2.41518151e+02 5.50264239e+00 1.96504024e+02 -1.01052902e-01 -5.61111135e+00 1.16714059e+02
1716.lowfreq: -10.3937 -0.0776 0.0004 0.0005 3.4835 8.6311 21.7864 58.7197 64.9736
frequency: 21.7025 58.6376 64.8986 78.0306 95.6923 131.3931 154.0081 185.7816 194.5678 219.0208 230.7163 242.3043 261.6361 277.7976 297.1066 303.5384 333.2161 342.5918 345.0025 354.9310 378.1053 416.8127 432.7457 459.9926 499.5978 519.7596 527.2292 546.4025 569.4686 600.5080 610.8744 683.7262 707.4945 743.7430 758.5459 787.3176 812.4745 831.0121 855.3447 858.9262 881.9841 889.6586 904.5253 924.0561 936.2156 973.8402 994.0898 1024.1060 1028.8379 1042.6342 1053.9443 1081.1161 1093.7014 1101.9755 1106.2930 1118.9905 1131.3075 1137.5920 1139.4556 1157.5902 1172.2623 1184.0834 1195.6186 1214.6333 1233.5896 1241.3617 1253.2408 1256.5584 1266.6083 1270.1617 1293.2624 1301.5114 1312.2988 1312.8634 1318.1705 1329.6232 1340.4858 1343.3780 1360.3536 1370.9550 1381.6743 1385.7568 1392.4614 1398.2916 1438.5584 1456.1808 1458.3530 1464.5181 1464.5891 1472.2133 1475.5127 1477.8736 1480.5099 1489.9250 1501.5070 1604.2426 1635.3194 2791.7858 2814.8364 2829.4053 2925.5115 2946.8481 2963.9036 2973.2327 2976.8657 2985.0928 2987.3983 3002.2290 3033.3837 3039.9327 3050.5666 3052.2730 3061.5913 3069.5891 3072.9881 3077.7603 3124.5110 3192.0941 3579.6890 3582.3274
redmass: 4.2655 2.2446 2.2771 3.2686 3.4084 2.8591 3.3161 2.2849 3.9205 3.7938 1.2884 3.2344 2.5245 1.4209 2.6457 3.7367 2.5835 3.3874 1.1158 2.1691 3.1920 3.8725 3.7889 4.3764 3.6155 4.0604 2.6215 4.0650 3.1997 3.9383 3.2703 3.4941 3.5247 3.1559 1.1309 2.3535 1.8946 1.7956 1.8310 1.7031 1.3669 1.6946 1.9662 1.7661 2.7679 4.5197 1.6339 2.7916 3.2322 2.6884 2.2443 2.3709 2.4871 2.0966 2.1725 1.5646 1.8742 1.8507 1.6494 1.9497 1.6588 1.6110 1.6647 1.6707 1.4038 1.3514 1.3244 1.3455 1.4164 1.2763 1.1608 1.2157 1.4718 1.3102 2.7027 1.5414 1.6371 1.6221 1.4744 1.4826 1.3731 1.3246 1.3082 3.2516 4.1219 1.0882 1.1736 1.0908 1.0828 1.0843 1.0854 1.0513 1.0537 1.0892 3.0541 7.0335 6.8798 1.0790 1.0719 1.0704 1.0580 1.0807 1.0984 1.0355 1.0616 1.0618 1.0597 1.0641 1.0955 1.0986 1.0982 1.0957 1.0887 1.0990 1.0996 1.0988 1.0897 1.0932 1.0652 1.0659
irintensity: 0.1726 0.0964 0.1506 1.0089 0.6370 0.1294 0.0863 1.3066 1.0000 6.9397 0.5106 1.2821 4.5732 75.4441 6.7158 2.6388 19.6455 19.0637 129.0493 2.2611 10.0123 3.1457 0.9650 5.5174 2.8025 7.0746 4.4298 7.9478 3.1143 9.6750 11.0543 5.4299 8.7694 7.1583 6.5494 1.9074 16.4419 3.4993 17.4356 22.9701 3.6792 1.8959 10.6448 5.4476 8.6252 89.5508 5.5078 6.5349 15.7458 12.4756 6.4330 45.5588 14.3546 38.0722 97.7252 33.1093 25.2159 91.5333 37.9322 1.1790 52.1842 24.7878 6.7428 7.3543 5.3284 14.7415 6.4696 21.0841 19.2133 4.9801 14.2720 2.0341 2.3422 4.8843 39.5189 8.7425 15.6945 2.2308 0.5572 8.5593 7.1843 13.3593 2.5183 58.5665 57.1264 11.8157 2.3504 4.0951 1.6966 5.7101 7.6506 12.2254 4.0033 12.5457 37.3152 119.9857 131.3252 44.9222 44.5533 180.9151 49.4065 10.3288 21.6650 44.9757 33.3983 47.2076 13.5886 40.3476 3.5805 37.0900 27.7754 38.9180 47.3785 65.7737 51.3121 72.7700 17.2600 0.3722 28.2133 30.4937
temp: 298.150 k
press: 1.00000 atm
elementType: 8 8 7 6 6 6 6 6 6 6 6 6 6 6 6 6 6 6 6 1 1 1 1 1 1 1 1 1 1 1 1 1 1 1 1 1 1 1 1 1 1 1
symmnumber: 1
zpe: 946227.5 jmol-1
zpe.correction: 0.360399 hartree
zpe.thermalcorrener: 0.378787 hartree
zpe.thermalcorrenthalpy: 0.379732 hartree
zpe.thermalcorrgfe: 0.314309 hartree
zpe.sumelectzpe: -827.235101 hartree
zpe.sumelectthermal: -827.216712 hartree
zpe.sumelectthermalent: -827.215768 hartree
zpe.sumelectthermalfe: -827.281190 hartree
dipole: -4.0046 0.7845 0.4193
dipole: 4.1022
quadrupole: -132.7141 -101.4492 -117.9096
quadrupole: 8.2038 -3.0178 -1.3848
quadrupole: -15.3565 15.9084 -0.5520 8.2038 -3.0178 -1.3848
hfenergy: -827.5954999 hartree
pointgroup: C01 [X(C16H23N1O2)]
dipole: 1.57973 -0.2856827 0.1662183 debye
polarizability: 241.3151419|6.2212045|196.4057546|0.7558743|7.4569112|117.0153366 unknown
InChI: InChI=1S/C16H23NO2/c1-2-7-17-8-3-4-12-14-9-11(18)10-16(19)13(14)5-6-15(12)17/h9-10,12,15,18-19H,2-8H2,1H3
charge 0 multiplicity 1
42 atoms
O  -3.334984 2.726361 0.451074
O  -4.797485 -1.748505 -0.366537
N  2.572879 -0.29821 -0.108016
C  1.19018 0.17649 0.230244
C  0.149409 -0.85658 -0.299746
C  0.393862 -2.23392 0.369439
C  0.853575 1.565381 -0.350116
C  1.84573 -2.685294 0.123404
C  -1.302209 -0.367345 -0.164266
C  2.84381 -1.600755 0.561129
C  -0.506269 2.052137 0.192974
C  -1.600505 1.001869 0.070446
C  3.64114 0.695511 0.197477
C  -2.36825 -1.291352 -0.315272
C  -2.966309 1.392484 0.185686
C  5.053904 0.258834 -0.252241
C  -3.7114 -0.863761 -0.217324
C  -4.027286 0.482079 0.043467
C  6.047855 1.440728 -0.208951
H  1.075182 0.239601 1.349369
H  0.374081 -0.973281 -1.382842
H  -0.299809 -2.998221 -0.024945
H  0.195497 -2.148976 1.457399
H  0.829876 1.498475 -1.455048
H  1.614351 2.316351 -0.077554
H  2.059682 -3.621704 0.674143
H  1.992287 -2.88962 -0.955045
H  2.800128 -1.487477 1.678405
H  3.865475 -1.925148 0.303634
H  -0.78138 2.972069 -0.36851
H  -0.379048 2.355158 1.255401
H  3.409872 1.628688 -0.343931
H  3.667545 0.948608 1.291823
H  -2.155154 -2.347958 -0.516076
H  5.440752 -0.555331 0.38926
H  4.984463 -0.142523 -1.281963
H  -5.064249 0.812537 0.130545
H  5.74338 2.244278 -0.905677
H  6.1044 1.878266 0.806142
H  7.065592 1.116467 -0.492023
H  -2.53504 3.301764 0.537089
H  -4.474128 -2.666978 -0.540665
