program: Gaussian 09
title: 000137134
version: EM64L-G09RevD.01
frameworkgroup: C1[X(C8H4F3NS)]
method: RPBEPBE
basis: SDD
operation: Freq
keyword: #p
keyword: freq=noraman
keyword: PBEPBE/SDD
title: #p freq=noraman PBEPBE/SDD
converged: NO YES NO NO
title: Mulliken charges:
elementType: S F F F N C C C C C C C C H H H H
charge: 0.166764 -0.162502 -0.165258 -0.165179 0.312428 0.308184 -0.342340 -0.282979 0.261481 -0.363882 -0.366705 0.505396 -0.777250 0.273301 0.267911 0.265228 0.265402
chargesum: 0.00000
title: Mulliken charges with hydrogens summed into heavy atoms:
elementType: S F F F N C C C C C C C C
charge: 0.166764 -0.162502 -0.165258 -0.165179 0.312428 0.308184 -0.069038 -0.015069 0.261481 -0.098654 -0.101303 0.505396 -0.777250
polarizability: 2.42148072e+02 -1.59982635e-01 8.90413652e+01 -8.22315177e-02 -5.56106200e-04 4.73393372e+01
1716.lowfreq: -22.2777 -7.6872 -5.3782 0.0012 0.0014 0.0015 6.5138 16.6106 40.3223
frequency: -22.0029 16.6103 40.3163 116.8374 166.0019 237.0633 239.9256 338.4467 368.3859 383.8327 403.2510 429.3314 436.1664 448.1631 484.1470 519.6860 565.0853 628.1390 631.3577 725.9016 734.7520 832.9248 847.6540 907.7080 962.1538 973.2377 986.4686 986.8188 1018.7512 1032.1785 1127.7647 1189.4292 1274.9026 1292.4603 1304.7606 1361.9951 1421.3675 1502.1275 1568.7436 1619.9985 2194.6293 3157.0727 3163.8126 3177.7881 3183.5011
redmass: 6.0073 12.0880 12.5650 11.5741 9.8008 9.4196 17.8780 12.8426 8.6622 9.0794 2.9974 10.7259 8.5393 9.3551 6.8842 9.8324 3.2032 13.3421 7.2926 8.8691 3.9830 1.2829 1.5796 8.1084 1.4480 1.7333 5.9337 3.9871 3.5942 4.3697 1.4091 1.1169 2.8340 9.9780 1.2907 5.4093 3.7458 2.8285 7.4786 6.2711 12.8871 1.0894 1.0891 1.0974 1.0981
irintensity: 0.1389 0.5577 1.2050 0.5574 2.8203 0.5291 1.3114 4.8341 0.2674 0.3690 0.0012 0.0498 0.9386 39.7295 2.0285 0.1518 20.6445 0.0525 0.6621 3.7090 0.5339 7.3399 113.1146 65.7208 12.1778 57.6869 164.8395 155.6296 130.6487 134.9364 1.3877 20.0743 179.7253 305.2190 3.0023 2.1354 11.3620 9.3456 7.3332 164.6847 1525.0765 2.0841 1.6701 2.3068 0.7599
temp: 298.150 k
press: 1.00000 atm
elementType: 16 9 9 9 7 6 6 6 6 6 6 6 6 1 1 1 1
symmnumber: 1
zpe: 269169.6 jmol-1
zpe.correction: 0.102521 hartree
zpe.thermalcorrener: 0.113245 hartree
zpe.thermalcorrenthalpy: 0.114190 hartree
zpe.thermalcorrgfe: 0.063464 hartree
zpe.sumelectzpe: -1058.683520 hartree
zpe.sumelectthermal: -1058.672796 hartree
zpe.sumelectthermalent: -1058.671852 hartree
zpe.sumelectthermalfe: -1058.722577 hartree
dipole: 1.0021 0.1405 -0.0022
dipole: 1.0119
quadrupole: -105.3581 -72.1586 -83.5940
quadrupole: -0.4137 0.0026 -0.0003
quadrupole: -18.3212 14.8783 3.4429 -0.4137 0.0026 -0.0003
hfenergy: -1058.7860413 hartree
pointgroup: C01 [X(C8H4F3N1S1)]
dipole: 0.394274 0.0550457 0.0013662 debye
dipolederiv: -1.4093001 0.0085176 -0.0071481 0.0182713 -0.0424222 0.0000916 -0.0013867 0.000003 -0.0441305 -0.6537517 0.2341669 -0.0050142 0.2517622 -0.6898642 0.007094 -0.0035204 0.0063542 -0.2864191 -0.7958785 -0.1121069 -0.1930145 -0.2453122 -0.3845377 -0.2131354 -0.2739285 -0.1826055 -0.6367353 -0.8059631 -0.1095573 0.1937069 -0.2413636 -0.3757128 0.2046058 0.2814582 0.1762323 -0.6407249 -2.9574805 0.0189765 -0.0142411 0.011982 -0.1391009 0.0001566 -0.0164467 0.0002137 -0.023994 -0.7975194 0.0016755 -0.0039115 0.0665412 -0.0982189 0.0002408 -0.0086986 -0.0002272 -0.1748322 0.2283832 -0.0813244 0.0019736 0.096701 0.0488059 0.0005011 0.0027531 -0.0007628 -0.0908101 0.2147741 0.0876147 0.0018602 -0.0733774 0.0626535 -0.0005527 0.0031243 0.0008707 -0.0845881 2.669807 -0.0137953 0.0069133 0.1482119 1.3579404 0.0010372 0.0016271 0.000084 1.5666557 -0.4479894 0.1059524 -0.0014941 0.2652689 -0.0025314 0.0013516 -0.0021838 0.00055 -0.1524655 -0.4428544 -0.1024936 -0.0013316 -0.2528473 0.0009889 -0.0015538 -0.0017682 -0.0008708 -0.1515847 1.827698 -0.0086162 0.0092623 -0.0038057 0.2503331 -0.0001552 0.0109142 -0.0001717 0.1137593 3.1549578 -0.0226637 0.0154484 -0.029162 -0.0410239 -0.000154 0.0113353 -0.0000929 -0.0577339 0.0740362 0.0509774 -0.0005845 0.0542411 0.0227179 0.0004451 -0.0006096 0.0005224 0.1613055 0.0491531 -0.0585282 -0.0006281 -0.0650201 0.0175936 -0.0002696 -0.0008074 -0.0004041 0.1575326 0.0453809 -0.0662841 -0.0008405 -0.0680303 0.0063257 -0.0002498 -0.0008614 -0.0002639 0.1726248 0.0465468 0.0674888 -0.0009564 0.0659391 0.0060529 0.0005464 -0.0010009 0.0005686 0.1721405 unknown
polarizability: 242.1422881|-0.2447874|89.04156|1.0438694|-0.0367237|47.3449262 unknown
InChI: InChI=1S/C8H4F3NS/c9-8(10,11)6-1-3-7(4-2-6)12-5-13/h1-4H
charge 0 multiplicity 1
17 atoms
S  5.718237 -0.027549 -0.045452
F  -3.385547 1.287481 -0.111496
F  -3.341653 -0.695074 -1.218181
F  -3.355001 -0.66789 1.042295
N  2.884978 -0.000666 -0.056851
C  -1.313037 0.019643 -0.084602
C  -0.604034 1.242384 -0.080936
C  -0.612902 -1.21262 -0.078858
C  -2.812693 -0.001155 -0.093083
C  0.802114 1.241335 -0.071571
C  0.790968 -1.224136 -0.06942
C  1.509026 0.006682 -0.065649
C  4.092743 -0.007116 -0.048798
H  -1.149711 2.189906 -0.085604
H  -1.16456 -2.157783 -0.082174
H  1.361307 2.181101 -0.068721
H  1.342566 -2.168343 -0.064899
