program: Gaussian 09
title: 000137127
version: EM64L-G09RevD.01
frameworkgroup: CI[X(C2H6)]
method: RPBEPBE
basis: SDD
operation: Freq
keyword: #p
keyword: freq=noraman
keyword: PBEPBE/SDD
title: #p freq=noraman PBEPBE/SDD
converged: YES YES YES YES
title: Mulliken charges:
elementType: C C H H H H H H
charge: -0.638317 -0.638317 0.212773 0.212769 0.212774 0.212769 0.212774 0.212773
chargesum: 0.00000
title: Mulliken charges with hydrogens summed into heavy atoms:
elementType: C C
charge: 0.000000 0.000000
polarizability: 2.38633489e+01 -5.28681018e-04 2.21014713e+01 5.74147365e-04 -1.01076700e-04 2.21014506e+01
1716.lowfreq: -19.6643 -11.8566 -0.0010 -0.0009 -0.0009 24.2672 294.2760 816.4884 817.1913
frequency: 294.2760 816.4884 817.1913 1008.6042 1193.5501 1193.8286 1391.9560 1395.1807 1484.9444 1485.4792 1485.7517 1486.6469 2978.0815 2981.3077 3058.4701 3058.7404 3087.2959 3087.5615
redmass: 1.0078 1.0577 1.0578 3.5521 1.4629 1.4632 1.1999 1.2155 1.0224 1.0225 1.0642 1.0641 1.0329 1.0378 1.0992 1.0992 1.1006 1.1006
irintensity: 0.0000 13.8734 13.8941 0.0000 0.0000 0.0000 18.9835 0.0000 0.0000 0.0000 20.8653 20.8278 71.2094 0.0000 0.0000 0.0000 94.0840 94.1093
temp: 298.150 k
press: 1.00000 atm
elementType: 6 6 1 1 1 1 1 1
symmnumber: 1
zpe: 193228.9 jmol-1
zpe.correction: 0.073597 hartree
zpe.thermalcorrener: 0.077110 hartree
zpe.thermalcorrenthalpy: 0.078055 hartree
zpe.thermalcorrgfe: 0.050431 hartree
zpe.sumelectzpe: -79.617624 hartree
zpe.sumelectthermal: -79.614111 hartree
zpe.sumelectthermalent: -79.613166 hartree
zpe.sumelectthermalfe: -79.640790 hartree
dipole: 0.0000 0.0000 0.0000
dipole: 0.0000
quadrupole: -15.0444 -14.5726 -14.5724
quadrupole: -0.0001 0.0001 0.0000
quadrupole: -0.3146 0.1572 0.1574 -0.0001 0.0001 0.0000
hfenergy: -79.6912211 hartree
pointgroup: CI [X(C2H6)]
dipole: 0. 0. 0. debye
dipolederiv: -0.0351818 -0.0000872 0.0000894 0.0000499 0.0783664 0.0000011 -0.0000296 -0.000062 0.0784575 -0.0351818 -0.0000872 0.0000894 0.0000499 0.0783664 0.0000011 -0.0000296 -0.000062 0.0784575 0.0117383 0.0575349 0.0685248 0.0797028 -0.0033232 -0.129658 0.0949271 -0.1296893 -0.048948 0.0117136 0.0306458 -0.0841307 0.0423715 0.0748039 0.0845803 -0.1164697 0.0846249 -0.1270431 0.0117299 -0.0880935 0.0155165 -0.1221241 -0.1498471 0.0450765 0.0215722 0.0451264 0.0975336 0.0117136 0.0306458 -0.0841307 0.0423715 0.0748039 0.0845803 -0.1164697 0.0846249 -0.1270431 0.0117299 -0.0880935 0.0155165 -0.1221241 -0.1498471 0.0450765 0.0215722 0.0451264 0.0975336 0.0117383 0.0575349 0.0685248 0.0797028 -0.0033232 -0.129658 0.0949271 -0.1296893 -0.048948 unknown
polarizability: 23.8633489|-0.0005287|22.1014713|0.0005741|-0.0001011|22.1014506 unknown
InChI: InChI=1S/C2H6/c1-2/h1-2H3
charge 0 multiplicity 1
8 atoms
C  -0.771929 0.000037 -0.000027
C  0.771929 -0.000037 0.000027
H  -1.171918 0.662723 0.789393
H  -1.171968 0.35232 -0.968646
H  -1.171903 -1.014951 0.179212
H  1.171968 -0.35232 0.968646
H  1.171903 1.014951 -0.179212
H  1.171918 -0.662723 -0.789393
