program: Gaussian 09
title: 000137124
version: EM64L-G09RevD.01
frameworkgroup: C1[X(C9H24Si3)]
method: RPBEPBE
basis: SDD
operation: Freq
keyword: #pfreq=noraman
keyword: PBEPBE/SDD
title: #p freq=noraman PBEPBE/SDD
converged: NO YES NO NO
title: Mulliken charges:
elementType: Si Si Si C C C C C C C C C H H H H H H H H H H H H H H H H H H H H H H H H
charge: 1.299149 1.298604 1.298523 -1.163623 -1.164131 -1.165096 -1.003191 -1.008131 -1.003163 -1.007777 -1.007932 -1.003004 0.245021 0.242855 0.243055 0.245100 0.245260 0.243188 0.231103 0.229799 0.231092 0.232399 0.231434 0.232376 0.231156 0.229768 0.231170 0.231740 0.232382 0.232295 0.231749 0.232351 0.232427 0.231119 0.231176 0.229756
chargesum: 0.00000
title: Mulliken charges with hydrogens summed into heavy atoms:
elementType: Si Si Si C C C C C C C C C
charge: 1.299149 1.298604 1.298523 -0.675747 -0.675976 -0.676649 -0.311196 -0.311922 -0.311069 -0.311360 -0.311405 -0.310953
polarizability: 1.76220695e+02 2.25316655e-02 1.76265962e+02 -4.85684669e-03 -1.12206066e-02 1.54424661e+02
1716.lowfreq: -7.0719 -0.0022 -0.0022 -0.0010 8.1469 10.8354 53.3341 65.9244 77.1207
frequency: 53.2191 65.5925 76.9218 92.0383 114.4648 123.3138 127.2640 131.8433 134.4762 143.6351 152.1618 160.2905 161.4835 166.6957 180.8472 182.6279 193.3889 224.0655 227.4098 228.0965 237.5685 275.7823 278.2786 345.9522 556.1519 566.6804 568.2195 628.9328 633.2425 642.9385 643.8083 659.0759 687.4271 688.0873 693.0615 738.4038 744.8667 745.7963 758.4536 772.6306 774.1489 786.0650 822.2287 822.8777 827.1853 863.8938 886.0683 888.0995 906.9679 907.2032 908.4019 1005.7381 1061.2444 1063.1582 1076.8195 1098.4072 1101.5637 1282.8926 1284.7409 1287.7317 1292.0751 1293.6528 1302.8215 1391.5586 1395.0572 1404.0134 1434.9016 1443.1517 1443.7962 1446.2934 1446.8119 1448.2423 1451.1429 1451.4090 1452.1848 1460.1150 1460.8180 1461.4751 2965.1180 2965.6796 2967.5254 2973.7198 2974.4629 2974.9408 2978.8487 2979.7312 2981.5555 3029.1169 3029.3941 3030.1366 3076.5866 3077.3215 3078.4033 3079.3323 3080.0957 3080.1450 3080.6881 3080.8589 3081.2818 3085.9279 3087.8501 3094.0268
redmass: 2.0671 2.5670 1.1293 2.8840 1.0354 1.1346 1.5788 1.6137 1.1859 1.3009 1.8366 1.4762 2.7296 2.6546 2.9303 2.8916 2.6024 2.1768 2.3473 2.7306 1.7759 3.4540 3.4442 4.2939 3.9512 3.6639 3.6831 1.5370 1.5230 3.7274 3.7803 3.5793 2.8948 2.9237 2.8967 1.7073 2.7914 2.7999 2.9251 1.3494 1.3354 1.2357 1.3733 1.3679 1.4621 1.9765 1.4118 1.4069 1.7368 1.7392 1.5153 1.0704 1.0981 1.1009 1.2942 1.3575 1.3485 1.2076 1.2062 1.2012 1.1967 1.1963 1.1928 1.0838 1.0832 1.0766 1.0523 1.0546 1.0546 1.0542 1.0543 1.0528 1.0511 1.0504 1.0510 1.0495 1.0501 1.0492 1.0586 1.0585 1.0578 1.0339 1.0338 1.0339 1.0344 1.0344 1.0345 1.0980 1.0978 1.0974 1.0986 1.0985 1.0984 1.0981 1.0980 1.0982 1.0983 1.0980 1.0983 1.0980 1.0977 1.0961
irintensity: 0.0009 0.0018 0.0037 0.0760 0.0008 0.0681 0.0633 0.0518 0.0888 0.1204 0.1018 0.0246 0.2600 0.3410 0.1801 0.2340 0.2171 4.4777 4.5253 0.8174 3.6238 0.3760 0.3503 0.4513 4.6074 7.1129 7.5411 6.1554 6.0972 0.1481 0.2287 1.3720 12.3832 11.9491 20.7418 4.2277 32.8317 35.2767 0.2776 14.1871 11.8133 0.1067 7.1334 7.7524 0.1296 217.9581 115.6039 116.0912 260.9787 263.0903 40.5644 0.0333 0.2082 0.5247 1.5356 103.8159 100.9550 4.4861 8.7408 58.8845 38.3634 33.7101 64.2930 7.1040 7.1278 4.7283 0.0295 1.4062 1.2841 2.3500 1.8216 21.3388 8.4200 0.3722 5.8372 13.6017 5.3628 18.3803 13.7616 13.4719 13.9538 25.7939 25.4657 22.8593 5.7235 10.8587 28.9398 6.2267 9.9302 11.0642 0.0937 0.2315 0.3715 19.6154 26.3370 33.4154 15.1621 56.5446 30.3470 36.3128 35.1927 5.6480
temp: 298.150 k
press: 1.00000 atm
elementType: 14 14 14 6 6 6 6 6 6 6 6 6 1 1 1 1 1 1 1 1 1 1 1 1 1 1 1 1 1 1 1 1 1 1 1 1
symmnumber: 1
zpe: 794158.3 jmol-1
zpe.correction: 0.302479 hartree
zpe.thermalcorrener: 0.323247 hartree
zpe.thermalcorrenthalpy: 0.324191 hartree
zpe.thermalcorrgfe: 0.254911 hartree
zpe.sumelectzpe: -1224.607292 hartree
zpe.sumelectthermal: -1224.586524 hartree
zpe.sumelectthermalent: -1224.585580 hartree
zpe.sumelectthermalfe: -1224.654859 hartree
dipole: 0.0033 -0.0011 -0.1253
dipole: 0.1253
quadrupole: -101.2938 -101.2855 -101.7615
quadrupole: 0.0012 0.0013 -0.0044
quadrupole: 0.1532 0.1615 -0.3146 0.0012 0.0013 -0.0044
hfenergy: -1224.9097705 hartree
pointgroup: C01 [X(C9H24Si3)]
dipole: -0.0011875 0.0006191 0.0492952 debye
polarizability: 176.2226659|0.0243451|176.2639531|0.0070611|0.0305286|154.4246996 unknown
InChI: InChI=1S/C9H24Si3/c1-10(2)7-11(3,4)9-12(5,6)8-10/h7-9H2,1-6H3
charge 0 multiplicity 1
36 atoms
Si 1.088723 1.561418 0.112304
Si 0.807269 -1.723734 0.108756
Si -1.896514 0.163777 0.109577
C  1.806664 -0.155245 0.60247
C  -0.769038 1.642419 0.604863
C  -1.038466 -1.488582 0.595353
C  2.046821 2.932805 1.054925
C  1.304133 1.87225 -1.768558
C  1.514167 -3.235744 1.058002
C  0.976344 -2.073058 -1.77042
C  -2.280304 0.199473 -1.769876
C  -3.560103 0.307038 1.058118
H  2.833726 -0.243023 0.190593
H  1.920378 -0.166547 1.70789
H  -0.81868 1.743906 1.710363
H  -1.205714 2.576652 0.194106
H  -1.627794 -2.331448 0.177713
H  -1.10719 -1.588006 1.700094
H  1.651571 3.935029 0.803944
H  1.95872 2.796228 2.148811
H  3.121832 2.914783 0.7946
H  2.374454 1.844642 -2.046471
H  0.776846 1.117726 -2.378825
H  0.909154 2.867612 -2.045992
H  2.579443 -3.397369 0.807478
H  1.44068 -3.08509 2.151116
H  0.959556 -4.158286 0.803129
H  0.597428 -1.240898 -2.390117
H  2.036891 -2.237576 -2.038703
H  0.412861 -2.983998 -2.046826
H  -1.366158 0.132248 -2.38612
H  -2.937573 -0.646273 -2.046374
H  -2.802964 1.135912 -2.041087
H  -4.080174 1.249174 0.802214
H  -4.233809 -0.533935 0.808005
H  -3.392983 0.295922 2.151246
