program: Gaussian 09
title: 000137120
version: EM64L-G09RevD.01
frameworkgroup: C1[X(C16H18)]
method: RPBEPBE
basis: SDD
operation: Freq
keyword: #p
keyword: freq=noraman
keyword: PBEPBE/SDD
title: #p freq=noraman PBEPBE/SDD
converged: YES YES NO NO
title: Mulliken charges:
elementType: C C C C C C C C C C C C C C C C H H H H H H H H H H H H H H H H H H
charge: 0.134401 0.497319 -0.700171 -0.698980 -0.748751 -0.411771 -0.429540 0.357006 -0.437062 -0.420087 0.337387 -0.397823 -0.398954 -0.237301 -0.237129 -0.243782 0.207334 0.216302 0.223264 0.215084 0.207309 0.223442 0.216827 0.216360 0.216973 0.224877 0.245265 0.234996 0.234503 0.237865 0.238118 0.224115 0.224122 0.228481
chargesum: 0.00000
title: Mulliken charges with hydrogens summed into heavy atoms:
elementType: C C C C C C C C C C C C C C C C
charge: 0.134401 0.497319 -0.053272 -0.053145 -0.098591 -0.186894 -0.184274 0.357006 -0.202065 -0.185584 0.337387 -0.159958 -0.160836 -0.013186 -0.013006 -0.015302
polarizability: 2.78445718e+02 -4.95119045e-01 1.58992410e+02 7.86390813e-02 1.55104401e+00 9.83988738e+01
1716.lowfreq: -4.7391 -2.1714 -0.0006 0.0003 0.0004 15.5947 39.1974 48.7829 75.1601
frequency: 39.0088 48.7170 75.1583 91.6635 137.3783 198.1467 210.8592 227.3914 256.0168 268.4194 312.4801 314.0813 342.8765 375.2813 390.8890 404.8505 411.2918 434.5591 465.6846 514.0252 542.0620 573.8228 614.5046 639.2446 660.4141 702.0107 742.3766 752.6471 773.1707 835.1515 845.2353 846.1335 849.8674 917.5058 919.5859 931.5843 942.4207 960.4798 971.5730 973.0297 988.4126 992.5441 995.5241 1015.6953 1022.0727 1024.6479 1040.6173 1084.1738 1115.3514 1128.9477 1172.8063 1192.0209 1204.4570 1210.8616 1219.0937 1274.2064 1293.2613 1307.1547 1316.4897 1352.1436 1372.3322 1373.4728 1377.5823 1403.0953 1411.7691 1436.6426 1458.8403 1465.4470 1468.3601 1475.5899 1480.6104 1487.3836 1496.7266 1517.4937 1562.0670 1587.4383 1612.9405 1621.5153 2971.2233 2972.4207 2977.3464 3066.3927 3067.7270 3069.3980 3075.7662 3077.3930 3080.2068 3118.3620 3121.3418 3125.5005 3128.6615 3139.3259 3143.4624 3148.0064 3160.0472 3164.0419
redmass: 3.1841 4.0077 3.6179 4.1993 3.4992 1.5786 1.8864 3.2921 1.7871 1.4493 1.1587 2.1328 2.7495 2.8396 3.2851 2.8505 2.9064 3.4722 3.2402 3.3174 3.3856 2.3654 6.4272 6.9565 5.3567 1.7462 2.7860 5.4897 2.1037 2.5245 1.5758 1.3105 1.2624 1.6215 1.5408 1.6265 1.2161 1.3476 1.3968 1.4398 4.9444 1.3123 6.0198 2.6174 1.5130 1.3958 1.9653 1.6223 2.2600 1.4816 1.0529 1.1153 3.0060 1.1817 2.3279 3.0303 3.0022 1.4333 1.3622 2.9862 2.2086 1.6196 1.3905 1.2024 3.5597 2.3655 1.0517 1.0515 1.1079 1.5060 1.2572 1.0508 1.0851 2.6084 5.9400 6.3892 6.0336 6.2810 1.0346 1.0347 1.0358 1.1000 1.0999 1.1007 1.0984 1.0996 1.0993 1.0862 1.0844 1.0876 1.0876 1.0922 1.0950 1.0962 1.0943 1.1015
irintensity: 0.1076 0.3803 0.0158 0.2166 0.0524 0.2020 0.0190 0.0056 0.1017 0.0123 0.0516 0.1216 0.0223 0.9781 0.3402 0.2965 0.0171 0.5386 0.3940 14.3434 2.5662 10.3700 0.0346 0.2423 3.7389 47.5486 30.3879 0.0688 53.8072 6.0961 31.7847 8.2712 0.0178 3.5823 1.4994 2.3042 0.2765 0.1003 1.1343 0.1589 0.2520 0.0905 10.0702 0.1048 2.8155 0.5675 8.3682 8.4472 20.8599 7.2797 0.0388 0.4573 6.6794 0.8714 1.7635 43.5458 0.0606 4.4622 0.6052 2.8849 9.4533 12.5359 20.4618 10.3023 6.6270 3.4880 0.1414 0.9194 7.3563 36.9069 20.3244 11.6921 24.7428 15.6580 1.6972 1.6739 13.8379 1.2984 34.2943 32.0769 37.1403 6.9918 3.6629 14.8436 140.6335 39.6052 43.0735 22.0608 4.4402 8.0689 7.8987 14.2045 15.0564 49.9794 14.8677 24.5823
temp: 298.150 k
press: 1.00000 atm
elementType: 6 6 6 6 6 6 6 6 6 6 6 6 6 6 6 6 1 1 1 1 1 1 1 1 1 1 1 1 1 1 1 1 1 1
symmnumber: 1
zpe: 757702.8 jmol-1
zpe.correction: 0.288594 hartree
zpe.thermalcorrener: 0.303387 hartree
zpe.thermalcorrenthalpy: 0.304331 hartree
zpe.thermalcorrgfe: 0.246900 hartree
zpe.sumelectzpe: -619.358891 hartree
zpe.sumelectthermal: -619.344099 hartree
zpe.sumelectthermalent: -619.343154 hartree
zpe.sumelectthermalfe: -619.400585 hartree
dipole: 0.6947 -0.0046 0.0006
dipole: 0.6947
quadrupole: -85.0654 -88.2103 -101.8407
quadrupole: 0.0350 -0.0322 0.2430
quadrupole: 6.6401 3.4952 -10.1352 0.0350 -0.0322 0.2430
hfenergy: -619.6474852 hartree
pointgroup: C01 [X(C16H18)]
dipole: -0.2733004 -0.0008161 -0.0012705 debye
polarizability: 278.4467243|0.2431309|118.4038676|0.2645628|28.537014|138.9864095 unknown
InChI: InChI=1S/C16H18/c1-16(2,3)15-11-9-14(10-12-15)13-7-5-4-6-8-13/h4-12H,1-3H3
charge 0 multiplicity 1
34 atoms
C  -3.768134 0.00243 0.007859
C  -2.221653 0.011399 0.036134
C  -4.271274 -1.433051 -0.333284
C  -4.271612 0.995865 -1.083164
C  -4.384886 0.421758 1.366849
C  -1.485546 -0.340591 -1.129207
C  -1.471299 0.359434 1.188317
C  0.671242 0.006002 0.014095
C  -0.078197 -0.343737 -1.143291
C  -0.059602 0.356801 1.178958
C  2.162319 0.002985 0.002949
C  2.887902 -0.932865 -0.785918
C  2.903024 0.935699 0.781409
C  4.29906 -0.935876 -0.79762
C  4.314152 0.932379 0.77359
C  5.021246 -0.003401 -0.016937
H  -5.376769 -1.449811 -0.376271
H  -3.888828 -1.779382 -1.310242
H  -3.942945 -2.15754 0.434376
H  -3.897561 0.72532 -2.086754
H  -5.37749 0.992267 -1.12077
H  -3.934802 2.025403 -0.862835
H  -5.487851 0.401121 1.294989
H  -4.089768 -0.266874 2.180044
H  -4.087663 1.447725 1.652999
H  -2.018538 -0.608466 -2.049174
H  -1.985739 0.628482 2.115819
H  0.448064 -0.590295 -2.072741
H  0.480188 0.600824 2.101435
H  2.342742 -1.683221 -1.36999
H  2.369148 1.688533 1.372613
H  4.835304 -1.672189 -1.407097
H  4.862094 1.66645 1.375314
H  6.116871 -0.005777 -0.024651
