program: Gaussian 09
title: 000137110
version: EM64L-G09RevD.01
frameworkgroup: C1[X(C10H10)]
method: RPBEPBE
basis: SDD
operation: Freq
keyword: #p
keyword: freq=noraman
keyword: PBEPBE/SDD
title: #p freq=noraman PBEPBE/SDD
converged: NO NO NO NO
title: Mulliken charges:
elementType: C C C C C C C C C C H H H H H H H H H H
charge: 0.244635 0.244640 0.244640 0.244637 -0.531503 -0.531504 -0.531504 -0.531503 -0.604101 -0.604100 0.230064 0.230079 0.230076 0.230066 0.230062 0.230080 0.230080 0.230063 0.257548 0.257547
chargesum: 0.00000
title: Mulliken charges with hydrogens summed into heavy atoms:
elementType: C C C C C C C C C C
charge: 0.244635 0.244640 0.244640 0.244637 -0.071361 -0.071362 -0.071362 -0.071361 -0.346553 -0.346553
polarizability: 1.41887650e+02 -5.99124232e-05 1.04413806e+02 -2.15448675e-05 -1.36494977e-03 5.83684983e+01
1716.lowfreq: -0.0007 -0.0007 -0.0007 4.0945 8.4799 16.6648 133.3325 153.9032 221.6818
frequency: 133.3325 153.9032 221.6794 280.1134 335.6158 369.6962 442.4421 455.8296 536.2449 684.7470 707.6422 748.7978 772.5034 774.4295 789.2877 799.4657 886.3134 894.0554 904.7196 907.4252 980.3781 1024.3640 1028.7753 1060.1316 1073.4455 1105.8008 1131.5746 1144.8661 1145.4426 1179.3059 1182.5990 1187.6354 1209.5353 1234.9865 1297.3065 1369.4510 1435.8288 1439.9215 1446.2147 1453.4729 1457.8373 1466.0689 1601.9537 1612.8302 2999.2511 2999.5302 3007.4294 3009.2225 3055.8022 3055.9116 3074.5074 3074.5671 3132.8552 3135.4077
redmass: 3.1731 1.8423 1.8305 3.6211 3.5416 2.6060 3.7260 5.4224 3.0653 5.6327 2.9251 1.1439 5.1543 1.1633 4.8620 2.9513 1.3371 1.2641 3.2461 3.4582 4.0912 2.0470 2.1091 1.1594 1.1914 1.8250 5.7145 1.1522 1.1341 1.3452 1.3967 1.3273 1.4794 1.4093 7.2624 3.8136 2.0249 1.0906 1.8562 1.1178 1.6080 2.1384 7.5733 8.8092 1.0564 1.0565 1.0617 1.0618 1.1060 1.1061 1.1051 1.1052 1.0944 1.0936
irintensity: 8.5469 0.0000 0.0000 0.0000 5.3902 19.4757 0.0000 0.0000 0.0000 0.0000 0.0000 1.6850 0.0000 0.0000 1.9394 0.5569 40.8412 0.0000 5.9372 0.0000 0.0000 0.0000 0.0000 0.0000 4.5149 0.9365 0.5130 0.0000 0.0000 0.5220 0.0000 0.0000 30.1196 0.0000 0.0000 40.0371 2.1035 0.0000 8.5575 0.0000 6.4688 12.5623 0.0000 0.0000 0.0074 78.2769 174.8203 0.0004 0.0000 0.0000 0.2259 99.2709 27.1786 0.0001
temp: 298.150 k
press: 1.00000 atm
elementType: 6 6 6 6 6 6 6 6 6 6 1 1 1 1 1 1 1 1 1 1
symmnumber: 1
zpe: 434318.9 jmol-1
zpe.correction: 0.165423 hartree
zpe.thermalcorrener: 0.173255 hartree
zpe.thermalcorrenthalpy: 0.174200 hartree
zpe.thermalcorrgfe: 0.133143 hartree
zpe.sumelectzpe: -386.288581 hartree
zpe.sumelectthermal: -386.280749 hartree
zpe.sumelectthermalent: -386.279804 hartree
zpe.sumelectthermalfe: -386.320861 hartree
dipole: 0.0000 0.0000 0.0007
dipole: 0.0007
quadrupole: -52.4776 -55.5259 -60.4874
quadrupole: 0.0000 0.0000 0.0000
quadrupole: 3.6861 0.6377 -4.3238 0.0000 0.0000 0.0000
hfenergy: -386.454004 hartree
pointgroup: C01 [X(C10H10)]
dipole: -0.0000009 0.0000028 0.0002721 debye
dipolederiv: 0.1038734 -0.0335354 -0.0000223 0.3219661 -0.0557296 -0.0000254 -0.0000614 -0.0000059 -0.0922502 0.1038836 0.0335398 -0.0000179 -0.3219596 -0.0557325 0.0000339 -0.0000765 0.0000269 -0.092249 0.1038833 0.0335402 0.000024 -0.3219591 -0.0557325 -0.0000303 0.0000756 -0.000023 -0.0922487 0.103876 -0.0335357 0.000021 0.3219671 -0.0557287 0.0000317 0.0000697 0.000022 -0.0922497 0.0014418 0.080569 0.0000162 -0.0141999 -0.0151301 0.0000081 0.0000359 -0.0000055 0.1794039 0.0014426 -0.0805697 0.0000286 0.0141977 -0.0151303 -0.0000185 0.0000727 -0.0000054 0.1794041 0.0014438 -0.0805702 -0.0000324 0.0141979 -0.0151298 0.0000101 -0.000077 0.0000013 0.1794041 0.0014396 0.0805691 -0.0000174 -0.0141996 -0.0151284 -0.0000131 -0.0000389 -0.0000058 0.1794051 -0.0936483 -0.0000004 -0.0000054 -0.0000037 0.1372458 -0.0000418 -0.0000045 -0.0000134 -0.1148261 -0.0936495 -0.0000023 0.0000005 -0.0000039 0.1372479 0.0000385 -0.0000048 -0.000009 -0.1148245 -0.0519184 -0.0681083 -0.0739024 -0.051789 0.0288363 -0.0768533 -0.1372186 -0.1025402 -0.0543783 -0.0518646 -0.0680787 0.0738757 -0.0517569 0.0288257 0.0768695 0.1372129 0.1025592 -0.0543967 -0.0518642 0.0680713 0.0738736 0.0517484 0.0288367 -0.0768652 0.1372142 -0.1025572 -0.054423 -0.0519241 0.0681138 -0.0739081 0.0517955 0.0288284 0.0768569 -0.1372234 0.1025393 -0.0543527 -0.0519294 0.068112 0.0739111 0.0517911 0.028838 -0.0768506 0.137228 -0.102537 -0.0543707 -0.0518593 0.0680729 -0.0738708 0.0517525 0.0288273 0.0768715 -0.1372102 0.1025595 -0.0544049 -0.0518619 -0.0680749 -0.0738757 -0.0517524 0.0288307 -0.0768692 -0.1372146 -0.1025578 -0.0544073 -0.0519205 -0.0681119 0.0739017 -0.0517944 0.0288302 0.0768541 0.1372172 0.1025419 -0.0543686 0.0905781 -0.0000018 0.0000014 0.0000006 -0.1108523 0.000015 0.0000034 0.0000198 0.1580666 0.0905779 0.0000013 -0.0000015 0.0000015 -0.1108528 -0.0000219 0.0000003 -0.0000096 0.1580666 unknown
polarizability: 141.8876504|0.000248|104.413806|0.0000215|0.0013649|58.3684983 unknown
InChI: InChI=1S/C10H10/c1-2-8-6-10-4-3-9(10)5-7(1)8/h5-6H,1-4H2
charge 0 multiplicity 1
20 atoms
C  -1.173322 -0.71284 0.00001
C  -1.173336 0.712799 0.000034
C  1.173328 -0.712821 -0.000013
C  1.173313 0.712819 0.000048
C  -2.707818 -0.79851 0.000205
C  -2.707828 0.798445 0.000227
C  2.707819 -0.798465 0.000218
C  2.707808 0.79849 0.000251
C  0.00001 -1.497199 0.000052
C  -0.000018 1.497178 0.000154
H  -3.164413 -1.254521 -0.896624
H  -3.164198 -1.254585 0.89711
H  -3.164169 1.254456 0.897186
H  -3.164482 1.254509 -0.896546
H  3.164471 -1.254469 -0.896588
H  3.164163 -1.254536 0.897144
H  3.164172 1.254535 0.897179
H  3.164417 1.254534 -0.896557
H  0.000008 -2.592922 0.00015
H  -0.000026 2.592902 0.00026
