program: Gaussian 09
title: 000137079
version: EM64L-G09RevD.01
frameworkgroup: C1[X(C8H9F7O2)]
method: RPBEPBE
basis: SDD
operation: Freq
keyword: #pfreq=noraman
keyword: PBEPBE/SDD
title: #p freq=noraman PBEPBE/SDD
converged: YES YES NO NO
title: Mulliken charges:
elementType: F F F F F F F O O C C C C C C C C H H H H H H H H H
charge: -0.131480 -0.141731 -0.127406 -0.133100 -0.146710 -0.119089 -0.122579 -0.233382 -0.175827 0.205510 0.239820 -0.366894 -0.262003 -0.346093 0.209078 0.371281 -0.683771 0.217115 0.218143 0.238671 0.239066 0.199331 0.199912 0.214548 0.214882 0.222708
chargesum: 0.00000
title: Mulliken charges with hydrogens summed into heavy atoms:
elementType: F F F F F F F O O C C C C C C C C
charge: -0.131480 -0.141731 -0.127406 -0.133100 -0.146710 -0.119089 -0.122579 -0.233382 -0.175827 0.205510 0.239820 0.068365 0.215735 0.053149 0.209078 0.371281 -0.031633
polarizability: 1.20082698e+02 -7.83483522e+00 8.46436127e+01 -1.76626913e+00 6.20510153e+00 8.86821214e+01
1716.lowfreq: -5.4104 -0.0012 -0.0011 -0.0010 2.8761 7.0490 11.4204 23.9879 39.3394
frequency: 11.3749 23.9727 39.3056 53.8321 61.0008 76.1569 101.4743 110.9912 142.6381 163.4862 197.1575 209.4396 226.2454 239.4604 243.1342 261.4021 284.8096 290.8151 313.8374 338.4172 355.7378 399.6736 420.2032 450.5000 478.8884 514.7303 548.1727 577.4917 652.7529 689.1401 740.6081 766.9275 797.7778 861.4902 887.7210 907.2332 931.5029 990.4575 1017.8899 1032.7372 1039.4114 1050.7181 1071.4766 1081.8650 1087.9504 1125.8098 1140.6776 1147.3793 1200.9517 1207.1325 1213.0966 1274.0930 1275.6633 1290.1138 1344.6311 1369.6258 1394.3112 1466.0893 1471.3117 1479.2464 1479.3157 1490.3048 1660.6354 2971.4535 2979.6414 2999.0907 3010.0246 3016.4621 3054.9747 3075.9967 3081.9612 3088.7047
redmass: 5.6111 13.7650 5.0008 3.0747 3.6826 5.6193 4.5249 2.4182 7.5983 4.2226 17.1548 6.1962 5.5406 5.7176 1.3036 11.6596 14.3010 14.6142 15.3242 17.4316 10.6903 4.3764 4.7609 14.9154 12.8367 15.8843 14.7222 15.6403 16.8562 12.3543 1.0704 9.6964 1.1487 8.4398 11.9150 1.8788 1.1711 12.7358 13.0295 12.4559 3.4025 11.9481 7.0114 2.6940 12.1256 2.6830 4.9238 1.7797 7.8397 12.0121 1.3510 1.2638 1.1919 1.0747 1.4166 1.5240 1.2113 1.0858 1.0714 1.0582 1.0446 1.0892 12.0229 1.0591 1.0362 1.0601 1.0564 1.1009 1.1039 1.1021 1.0995 1.1082
irintensity: 0.0341 0.0743 1.6350 0.0436 0.0612 0.0632 0.3418 0.3515 0.5753 0.9600 4.7987 1.7171 7.6872 3.5997 0.7592 3.3146 0.3073 1.0962 0.4034 0.8518 3.1358 10.5753 3.3944 14.7457 6.3123 2.5999 4.9957 10.4827 27.3484 12.6676 8.8861 28.2275 0.4451 30.9444 143.3692 6.1757 0.3589 112.9118 66.9790 17.1454 26.3858 71.6471 314.6868 16.9785 362.2760 3.0530 24.0562 12.8874 175.9249 40.6763 1.6569 3.5843 1.6163 0.1955 0.4456 13.7250 7.4211 1.5889 0.4515 6.7873 12.8439 21.2741 227.0402 28.6877 28.8792 12.0846 26.9332 8.9442 2.1364 31.8955 43.6071 71.3865
temp: 298.150 k
press: 1.00000 atm
elementType: 9 9 9 9 9 9 9 8 8 6 6 6 6 6 6 6 6 1 1 1 1 1 1 1 1 1
symmnumber: 1
zpe: 442921.6 jmol-1
zpe.correction: 0.168700 hartree
zpe.thermalcorrener: 0.187313 hartree
zpe.thermalcorrenthalpy: 0.188257 hartree
zpe.thermalcorrgfe: 0.118607 hartree
zpe.sumelectzpe: -1158.227286 hartree
zpe.sumelectthermal: -1158.208673 hartree
zpe.sumelectthermalent: -1158.207729 hartree
zpe.sumelectthermalfe: -1158.277379 hartree
dipole: -4.5744 1.0874 -0.1435
dipole: 4.7040
quadrupole: -87.2591 -100.4367 -103.3445
quadrupole: 2.2221 1.2776 -2.6133
quadrupole: 9.7543 -3.4232 -6.3311 2.2221 1.2776 -2.6133
hfenergy: -1158.3959861 hartree
pointgroup: C01 [X(C8H9F7O2)]
dipole: -1.7893095 -0.4507204 -0.142571 debye
dipolederiv: -0.5677358 -0.0307591 -0.1909814 -0.1129866 -0.2973858 -0.1009643 -0.183872 -0.0435755 -0.4050703 -0.3446426 0.0642351 -0.0018513 0.0887328 -0.6056874 0.1933909 0.005256 0.1339199 -0.3627507 -0.4641133 -0.045588 -0.1211869 -0.0090181 -0.2799272 -0.0405553 -0.2176175 -0.0698004 -0.475596 -0.6648512 -0.13515 0.1601302 -0.1356233 -0.3461922 0.0450326 0.2782951 0.0892187 -0.35788 -0.6834809 -0.0539827 0.1791779 -0.1629947 -0.4249675 0.0988819 0.2212121 0.0682294 -0.3562316 -0.5491279 -0.0254755 -0.236343 0.0627834 -0.3125813 0.0210915 -0.2546742 -0.0341651 -0.4711394 -0.3517871 0.1264429 0.1438861 0.1886742 -0.5117459 -0.2728226 0.1490445 -0.176542 -0.5615502 -1.5818635 -0.2705915 -0.3354959 -0.2950216 -0.302366 -0.0486206 -0.3467224 -0.0416237 -0.5699012 -0.5630446 -0.0644557 0.0770501 -0.0186497 -0.2718267 0.1049789 -0.3388285 -0.0534473 -0.8317247 0.8398507 -0.0742164 0.220063 0.0301192 0.963083 -0.125318 0.2203727 0.0127214 0.6869237 1.0826614 0.2164967 -0.0005802 0.0481382 0.5738335 0.0319328 -0.1036067 -0.0533213 0.8089814 -0.1278742 -0.0724703 -0.0321727 -0.0876642 0.1180132 -0.0027097 -0.0048769 0.0004432 0.0363597 0.984868 0.1306964 0.0682461 0.1809456 0.383144 0.0501023 -0.0377916 0.0126001 0.2269539 0.1114463 -0.0204729 -0.0336353 -0.0045514 0.1779139 0.006178 -0.1404475 -0.0196951 0.0569594 1.2969366 0.174398 0.1631379 0.2201218 0.1981653 -0.1313352 0.6703909 0.098192 1.2027063 1.5723915 -0.0377408 -0.1045149 -0.0876156 1.2306542 0.2016476 -0.0713193 0.077018 1.3732881 -0.0332911 -0.029175 -0.0525811 -0.0380471 0.081281 -0.010934 0.0005257 0.0021153 0.0414278 0.0398041 0.0423359 0.0539377 0.0668615 -0.0099635 -0.0963488 0.0399156 -0.0876688 -0.0274385 0.0693022 0.0192633 -0.0119795 0.0049148 -0.0847377 0.0981408 -0.026744 0.0808033 0.0181595 -0.0386961 -0.0053078 0.0144022 -0.0032641 -0.0249888 -0.0968091 0.0605775 -0.0645117 -0.0047738 -0.0430277 0.0262622 -0.0375366 -0.0025925 -0.0521777 0.0702222 0.0120676 0.0663189 0.0336207 0.0154768 0.0236644 0.0384927 0.048097 -0.0373582 -0.1400667 0.0618729 -0.1103854 -0.0694068 0.0303528 0.0417253 -0.0444329 0.0119919 -0.1071102 0.1273844 -0.0150272 0.1131882 -0.0111765 0.0882392 0.0034329 -0.0197583 0.0496428 -0.1091262 0.1232446 -0.0531047 0.0857827 0.0109002 0.0560816 0.0835294 0.0684935 0.0498225 -0.0227778 -0.1231958 0.0117034 -0.1123628 -0.041897 -0.1738749 -0.0870969 0.0360326 -0.0928168 0.0748322 0.0174516 0.0633986 0.0265481 0.050256 unknown
polarizability: 119.8661629|7.0327079|80.6269539|5.072168|1.1617275|92.9153158 unknown
InChI: InChI=1S/C8H9F7O2/c1-2-3-4-17-5(16)6(9,10)7(11,12)8(13,14)15/h2-4H2,1H3
charge 0 multiplicity 1
26 atoms
F  2.097505 1.507567 1.203141
F  0.736916 2.403095 -0.399337
F  0.731551 0.038334 -1.831463
F  2.821475 0.813513 -1.342537
F  0.953309 -1.828677 0.331597
F  3.08554 -1.126815 0.693846
F  2.509432 -2.001112 -1.314704
O  -1.232175 0.557226 0.22585
O  -0.17258 0.512808 2.31444
C  1.06566 1.201877 0.287202
C  1.66341 0.22014 -0.786459
C  -3.520941 -0.087793 -0.320457
C  -2.530988 0.082131 0.827517
C  -4.898145 -0.571757 0.197255
C  -0.181061 0.707939 1.087403
C  2.069372 -1.198992 -0.259996
C  -5.917679 -0.752093 -0.947513
H  -3.116989 -0.815085 -1.04965
H  -3.637149 0.875318 -0.852205
H  -2.854594 0.842504 1.561513
H  -2.325885 -0.864038 1.360972
H  -5.294323 0.155794 0.934212
H  -4.774933 -1.5318 0.738069
H  -6.082964 0.199674 -1.485683
H  -5.561541 -1.497135 -1.682964
H  -6.893923 -1.096823 -0.562148
