program: Gaussian 09
title: 000137075
version: EM64L-G09RevD.01
frameworkgroup: C1[X(C6H9N)]
method: RPBEPBE
basis: SDD
operation: Freq
keyword: #p
keyword: freq=noraman
keyword: PBEPBE/SDD
title: #p freq=noraman PBEPBE/SDD
converged: YES YES NO NO
title: Mulliken charges:
elementType: N C C C C C C H H H H H H H H H
charge: -0.407457 0.422848 -0.506734 -0.441045 -0.664188 -0.247281 -0.267287 0.209960 0.229222 0.297874 0.244958 0.231233 0.219696 0.196318 0.243733 0.238150
chargesum: 0.00000
title: Mulliken charges with hydrogens summed into heavy atoms:
elementType: N C C C C C C
charge: -0.109583 0.422848 -0.067552 -0.196087 -0.016942 -0.003548 -0.029137
polarizability: 8.67821776e+01 4.09435889e-01 7.00631889e+01 -5.54091845e+00 2.13105444e+00 4.28178686e+01
1716.lowfreq: -5.3767 -0.0007 -0.0006 0.0008 8.8325 16.6092 41.2614 150.8573 201.4262
frequency: 41.2046 150.8549 201.4202 317.8711 386.6582 561.9419 613.8252 615.0948 670.2238 703.8087 770.0102 795.5965 862.5697 874.1345 925.1402 982.6077 1024.9488 1049.4779 1065.7086 1092.4353 1132.3919 1231.0591 1241.6377 1288.8470 1321.2095 1387.0821 1395.9403 1418.3387 1469.0068 1475.1812 1475.9862 1483.8003 1575.6688 2962.6457 2977.6375 3043.6191 3072.1717 3087.3136 3201.3316 3216.1215 3240.2526 3601.1462
redmass: 2.3312 2.9646 1.2033 2.0937 3.3390 1.3792 3.1526 2.5580 2.7319 1.2875 1.1715 1.3130 1.3284 5.5707 2.8259 2.0059 1.5077 1.3780 1.8332 1.9675 1.3062 1.4730 1.9912 1.3973 1.5918 1.4518 2.0275 3.1751 1.0895 3.1931 1.0539 1.1936 4.1928 1.0673 1.0360 1.0934 1.0985 1.1008 1.0911 1.0966 1.1081 1.0807
irintensity: 1.2513 1.5618 0.2401 2.2743 3.2759 65.1406 0.9049 4.0726 1.2751 129.9811 7.8194 41.4982 0.2518 2.6644 10.6544 1.9828 25.9183 13.7504 1.9180 17.7475 7.3350 0.0543 4.8351 10.0984 14.2492 7.7166 8.2456 7.0827 3.6090 10.6696 12.3013 9.4114 10.7971 48.2951 37.1031 4.6690 64.5464 43.0048 6.1860 5.6390 3.9626 35.2833
temp: 298.150 k
press: 1.00000 atm
elementType: 7 6 6 6 6 6 6 1 1 1 1 1 1 1 1 1
symmnumber: 1
zpe: 358903.2 jmol-1
zpe.correction: 0.136699 hartree
zpe.thermalcorrener: 0.143645 hartree
zpe.thermalcorrenthalpy: 0.144589 hartree
zpe.thermalcorrgfe: 0.105277 hartree
zpe.sumelectzpe: -288.248848 hartree
zpe.sumelectthermal: -288.241902 hartree
zpe.sumelectthermalent: -288.240958 hartree
zpe.sumelectthermalfe: -288.280271 hartree
dipole: 1.3610 -1.5361 -0.3775
dipole: 2.0867
quadrupole: -40.8504 -36.8500 -46.3506
quadrupole: 0.9965 -1.4607 1.4522
quadrupole: 0.5000 4.5003 -5.0003 0.9965 -1.4607 1.4522
hfenergy: -288.3855473 hartree
pointgroup: C01 [X(C6H9N1)]
dipole: 0.5067032 -0.6441179 0.0488012 debye
dipolederiv: -0.2379293 0.2237731 -0.034019 0.2143044 -0.5224276 0.0240979 -0.0432225 0.0106774 -0.2280141 0.0533874 0.0130965 -0.0342072 -0.1460868 0.3423779 -0.0486653 -0.0531577 -0.0777577 -0.1047716 0.1714894 -0.0346335 -0.0103034 0.0543335 0.120761 0.0354166 -0.0477315 0.0446103 0.1754948 -0.1144702 0.02802 -0.0438797 0.057637 -0.0832794 -0.0515781 -0.0420405 -0.0429875 -0.252247 -0.0303024 0.0157182 -0.0378018 0.0174799 0.0796434 0.0183711 -0.0005246 0.018767 -0.0065136 0.0082642 -0.2552344 -0.0215096 -0.2232925 0.0874124 -0.0183089 -0.0081972 -0.0139979 -0.2367707 -0.0191281 0.0202845 -0.0697432 0.0265208 -0.0715046 -0.051454 -0.0509122 -0.041532 -0.228413 -0.0620874 0.0240371 0.0342549 0.0788628 -0.007205 -0.1467855 0.0671158 -0.0991658 -0.0980247 0.0360094 -0.0087601 -0.0031475 -0.065899 -0.1088934 0.1009392 -0.003685 0.0638556 0.054183 0.1915871 0.0489718 0.0263161 0.0419941 0.1839641 0.0275724 0.0348367 0.0306104 0.3075887 0.0938712 -0.0596354 0.0364115 -0.0439312 -0.0483342 0.0591587 0.0313703 0.0620093 0.1801328 0.1039424 0.042505 0.0355421 0.0103327 -0.0016002 -0.1223221 -0.0065832 -0.0918339 -0.074917 -0.2521154 0.001738 0.0311574 0.0023456 0.1004803 0.0115016 0.0452873 0.0115543 0.0657481 0.0774818 -0.0817813 0.0078578 -0.0335136 -0.1548501 0.0924713 -0.0144278 0.0596745 0.040928 0.0366901 -0.0557476 0.0480672 -0.0732637 0.0037844 0.0602155 0.0539239 0.0559428 0.2089805 -0.0566901 0.0776481 0.0350045 0.0821761 0.079671 0.0093695 0.0379482 0.0095732 0.1966158 unknown
polarizability: 86.7211938|-2.0661293|68.88831|-5.3125449|-6.0128312|44.0537314 unknown
InChI: InChI=1S/C6H9N/c1-2-6-4-3-5-7-6/h3-5,7H,2H2,1H3
charge 0 multiplicity 1
16 atoms
N  -0.39554 -1.013027 0.100354
C  0.282118 0.155409 -0.275219
C  1.759987 0.164995 -0.57595
C  -0.669641 1.186691 -0.288323
C  2.652664 -0.231974 0.631069
C  -1.748926 -0.739072 0.322977
C  -1.944172 0.626741 0.086861
H  1.988414 -0.506271 -1.430272
H  2.029425 1.184122 -0.90657
H  0.039848 -1.928394 0.197247
H  -0.46367 2.226242 -0.541459
H  2.471554 0.441378 1.487399
H  3.723779 -0.175629 0.362961
H  2.446932 -1.265542 0.968329
H  -2.448015 -1.516897 0.623522
H  -2.890957 1.157828 0.173075
