program: Gaussian 09
title: 000137072
version: EM64L-G09RevD.01
frameworkgroup: C1[X(C7H12)]
method: RPBEPBE
basis: SDD
operation: Freq
keyword: #p
keyword: freq=noraman
keyword: PBEPBE/SDD
title: #p freq=noraman PBEPBE/SDD
converged: YES YES NO NO
title: Mulliken charges:
elementType: C C C C C C C H H H H H H H H H H H H
charge: -0.460579 -0.461826 -0.123172 0.004468 -0.175870 -0.731209 -0.589283 0.202313 0.205169 0.206005 0.204883 0.214454 0.203583 0.211992 0.221268 0.222052 0.219417 0.212635 0.213701
chargesum: 0.00000
title: Mulliken charges with hydrogens summed into heavy atoms:
elementType: C C C C C C C
charge: -0.053097 -0.050938 0.091282 0.208050 0.036122 -0.068471 -0.162947
polarizability: 8.24193158e+01 2.72082339e+00 7.73613593e+01 8.23321290e+00 -1.78080013e+00 6.53028775e+01
1716.lowfreq: -20.3141 -3.6591 -0.0002 0.0004 0.0006 14.2544 45.1301 77.8585 81.6060
frequency: 45.0776 77.7322 81.5706 172.7494 195.0554 242.2471 303.8080 383.0737 446.3004 471.9205 626.9563 747.0687 825.0440 872.3465 929.0623 941.0756 948.4437 973.3628 996.5379 1014.3767 1039.3749 1044.1751 1097.7127 1162.8508 1200.8751 1210.3212 1281.9548 1285.3794 1291.2894 1318.0931 1336.7147 1393.0168 1425.4297 1456.7304 1460.6120 1462.3548 1472.6446 1659.4757 1692.8568 2951.8426 2963.3967 2965.9068 3014.4546 3031.1673 3037.4063 3064.8725 3069.3096 3071.8702 3088.5777 3089.9480 3192.9415
redmass: 2.6286 1.8653 1.9606 2.1062 1.3270 2.5341 1.8821 2.1893 2.2011 2.4948 1.4570 1.4275 1.9610 1.6390 1.6812 1.3989 1.4099 1.0989 1.2553 2.3074 1.3877 1.5307 2.8485 2.1431 1.1709 1.4742 1.2638 1.2061 1.2553 1.3036 1.4309 1.2392 1.1798 1.0907 1.1083 1.0480 1.0567 4.7787 6.2525 1.0611 1.0370 1.0617 1.0988 1.0971 1.0971 1.0933 1.0890 1.0817 1.0932 1.0756 1.1144
irintensity: 0.2079 0.0865 0.1228 1.0023 1.8811 2.0954 0.9743 0.0938 2.3288 0.0752 15.8318 0.4120 2.6276 3.2898 7.1840 90.0663 11.6903 51.7690 8.0723 4.5689 15.5995 0.3002 0.8626 0.6143 0.0589 1.0045 1.0667 0.8345 0.7761 0.2892 0.1866 10.8499 6.3146 22.1774 5.1374 12.1080 14.2421 15.3170 0.7199 20.3655 54.4700 59.8963 11.6771 31.5434 30.0003 6.0234 4.5215 42.0212 76.3198 7.7429 30.5943
temp: 298.150 k
press: 1.00000 atm
elementType: 6 6 6 6 6 6 6 1 1 1 1 1 1 1 1 1 1 1 1
symmnumber: 1
zpe: 437398.8 jmol-1
zpe.correction: 0.166596 hartree
zpe.thermalcorrener: 0.175610 hartree
zpe.thermalcorrenthalpy: 0.176554 hartree
zpe.thermalcorrgfe: 0.132153 hartree
zpe.sumelectzpe: -273.334273 hartree
zpe.sumelectthermal: -273.325259 hartree
zpe.sumelectthermalent: -273.324315 hartree
zpe.sumelectthermalfe: -273.368716 hartree
dipole: 0.2400 -0.3444 0.0735
dipole: 0.4262
quadrupole: -46.0923 -44.1256 -41.6016
quadrupole: 1.7368 0.6147 -0.1614
quadrupole: -2.1525 -0.1857 2.3383 1.7368 0.6147 -0.1614
hfenergy: -273.500869 hartree
pointgroup: C01 [X(C7H12)]
dipole: 0.095768 -0.1338199 0.0321458 debye
dipolederiv: 0.0698047 -0.0621606 0.0056364 -0.061417 0.1218815 0.0469861 -0.0273414 -0.0652717 0.1337688 0.1089503 0.0453222 -0.0230376 0.062041 -0.0124373 -0.0540585 0.0354026 0.0310072 0.1200941 -0.0698566 0.1213271 0.024281 0.2330803 -0.1615995 -0.043191 -0.0884422 -0.0554193 0.0958881 -0.1945857 -0.0917846 0.03022 -0.2126997 0.2055796 0.0122422 -0.0663852 0.0803775 0.1430228 0.0102103 0.2109368 0.0199013 0.213685 -0.0844329 -0.0466161 -0.0216533 -0.0976834 0.1251425 -0.0599094 -0.1230804 0.0315446 -0.136216 0.0326344 0.0327938 -0.0296803 0.0105471 0.0402788 -0.4280811 -0.0551576 0.0120809 -0.0208632 -0.1783379 0.079882 0.0269554 0.0935828 0.0863203 0.0176635 -0.0113211 -0.0269358 -0.0193756 0.0850221 -0.0106748 0.0018984 0.0681837 -0.1726683 -0.0247603 0.0119254 -0.0003173 -0.0137132 -0.196635 -0.0730171 0.0419183 -0.0933814 0.0553825 -0.1000837 -0.1070674 0.0252675 -0.0976712 -0.1160708 0.0317114 0.0768995 0.0184781 0.0735634 0.06215 0.0376235 0.0003368 0.0460907 0.0459398 0.0503048 -0.0252647 -0.0191935 -0.1694979 0.0758877 -0.053152 -0.0052348 -0.0788698 0.0991758 0.0626054 0.0192567 0.0584314 -0.1337632 0.1424294 0.0206334 -0.0464611 0.0426378 0.0422243 0.0099801 -0.0113891 -0.0284523 -0.1484318 0.0767852 -0.0715631 0.0356487 -0.0680023 0.0975633 0.0733264 0.0273237 0.0662704 -0.1444822 0.0825637 -0.0079429 -0.0541921 -0.0238139 0.0851096 0.0107211 0.0330543 0.0620659 -0.1545227 0.0626313 -0.0060951 0.0118113 -0.083058 -0.1356303 -0.0983779 0.0381388 -0.0982409 0.05299 -0.1822521 0.036704 -0.0430842 0.0823756 0.0495858 0.0267806 -0.0214156 0.0547911 0.0990704 0.1709448 0.0731412 0.0132154 0.1098916 -0.0641939 -0.0803702 0.0194539 -0.0945847 0.0255853 0.1795079 0.0317113 -0.010681 0.025898 0.0846216 -0.0310284 -0.0287298 0.008492 -0.127741 unknown
polarizability: 82.2145493|2.9459972|77.361971|8.3435107|-1.8768446|65.5070322 unknown
InChI: InChI=1S/C7H12/c1-3-5-7-6-4-2/h3-4,6H,1,5,7H2,2H3
charge 0 multiplicity 1
19 atoms
C  -0.138704 -1.413825 0.127242
C  -1.562734 -0.904255 -0.257125
C  0.977798 -0.522441 -0.376538
C  -1.93812 0.396052 0.422578
C  1.952081 0.026242 0.394599
C  3.071005 0.910125 -0.110787
C  -2.385953 1.513806 -0.201894
H  -0.067768 -1.517681 1.228171
H  -0.019317 -2.433316 -0.296617
H  -2.294497 -1.689101 0.029675
H  -1.633602 -0.78842 -1.356236
H  0.978062 -0.317259 -1.459725
H  -1.83219 0.405138 1.519793
H  1.94107 -0.174663 1.477898
H  3.002385 1.061864 -1.202657
H  3.045266 1.905001 0.375659
H  4.063243 0.471195 0.113063
H  -2.648725 2.419578 0.356456
H  -2.498901 1.555961 -1.292655
