program: Gaussian 09
title: 000137054
version: EM64L-G09RevD.01
frameworkgroup: C1[X(C20H18)]
method: RPBEPBE
basis: SDD
operation: Freq
keyword: #p
keyword: freq=noraman
keyword: PBEPBE/SDD
title: #p freq=noraman PBEPBE/SDD
converged: YES YES NO NO
title: Mulliken charges:
elementType: C C C C C C C C C C C C C C C C C C C C H H H H H H H H H H H H H H H H H H
charge: -0.377828 -0.624740 0.514874 0.464107 0.516963 -0.397718 -0.403005 -0.441009 -0.399138 -0.423706 -0.414819 -0.230767 -0.231057 -0.226463 -0.253978 -0.248381 -0.243186 -0.234689 -0.231406 -0.244277 0.235877 0.220084 0.217181 0.245145 0.235365 0.235980 0.246077 0.233200 0.240190 0.222366 0.224188 0.224659 0.223443 0.226119 0.227580 0.222496 0.224084 0.226189
chargesum: 0.00000
title: Mulliken charges with hydrogens summed into heavy atoms:
elementType: C C C C C C C C C C C C C C C C C C C C
charge: -0.141950 -0.187475 0.514874 0.464107 0.516963 -0.152573 -0.167640 -0.205029 -0.153061 -0.190507 -0.174629 -0.008401 -0.006868 -0.001804 -0.030536 -0.022261 -0.015606 -0.012193 -0.007321 -0.018089
polarizability: 2.51740101e+02 -2.01749923e+01 1.88171591e+02 -1.96362472e+01 -9.25730859e+00 1.65542722e+02
1716.lowfreq: -0.0007 -0.0001 0.0003 5.6249 7.6798 9.1365 27.4292 33.9616 37.8139
frequency: 26.7893 33.8037 37.7586 44.4552 58.0222 66.8200 128.8966 153.5980 218.2045 226.7675 247.8363 289.8431 364.6407 392.8101 402.1813 404.0481 404.1855 468.9542 498.6849 540.1693 560.6020 589.8930 615.0960 617.9344 618.5823 638.2381 704.9779 705.5845 706.3250 734.1208 758.7945 764.7309 790.2876 803.3619 853.0361 853.8582 854.8451 863.6074 913.0798 916.9688 929.3853 957.6392 976.2297 976.6055 977.6905 989.9723 990.5427 991.0275 992.8004 993.6734 994.2263 1010.9104 1027.2349 1028.2690 1031.9460 1075.6088 1081.4270 1091.7565 1161.3893 1170.8550 1171.9307 1172.4033 1187.6737 1188.9338 1191.0547 1192.6620 1209.2347 1219.6505 1249.8372 1285.6733 1315.8586 1328.5690 1336.8542 1340.8444 1379.9239 1383.5610 1384.5384 1436.8769 1440.7442 1441.5895 1474.9910 1481.3889 1483.2092 1486.3940 1590.2057 1592.8900 1593.0601 1609.4428 1613.8720 1614.7274 2980.3742 2987.8282 3047.9283 3111.3947 3116.1456 3116.9530 3120.0290 3120.3036 3123.5683 3132.1389 3133.0588 3137.2674 3143.3323 3143.4851 3148.0633 3160.8511 3161.3503 3162.7760
redmass: 4.3046 3.7098 3.9356 4.2878 4.5393 4.5630 4.0336 4.9897 4.4211 4.4658 4.7676 4.5794 2.1911 3.8346 2.8233 2.8330 2.8355 3.6847 3.5241 4.1408 3.6196 3.7167 6.1616 6.2391 6.2135 5.0175 1.7780 1.8117 1.7238 2.3619 1.9364 1.8391 2.6055 3.9776 1.2516 1.2485 1.2655 2.7935 1.4401 1.4240 1.6001 2.0772 1.4004 1.3996 1.4013 4.5360 5.7818 5.5938 1.4014 1.3198 1.3700 3.4229 2.2099 2.1798 2.2102 1.6152 1.6176 1.6327 1.2663 1.0649 1.0546 1.0584 1.8427 1.1398 1.3157 1.1382 1.7734 2.5620 1.5099 1.4489 1.4292 1.2759 1.2385 1.3275 7.3176 7.5259 6.7621 2.2143 2.1529 2.1571 1.2539 2.1968 2.2933 1.8716 6.0464 5.9803 5.9942 6.0509 6.1074 6.0946 1.0772 1.0647 1.1026 1.0870 1.0862 1.0848 1.0871 1.0862 1.0864 1.0913 1.0915 1.0918 1.0961 1.0960 1.0951 1.1015 1.1015 1.1013
irintensity: 0.0123 0.1114 0.0361 0.0043 0.0619 0.2423 0.5941 0.4210 1.1575 0.2992 0.2668 0.3775 0.7148 0.1321 0.1773 0.0527 0.0841 4.2638 1.4627 15.1422 29.9503 10.6387 0.8004 0.1381 1.1414 5.3058 42.4144 96.2579 14.9923 37.8127 15.7456 45.6990 24.2198 2.7963 0.1994 0.1247 0.0445 1.7926 2.0381 1.5573 4.5567 5.0367 0.0757 0.1228 0.1270 0.1056 0.1899 0.5751 0.5269 0.5718 0.0491 2.4070 6.5263 15.2514 1.0129 19.8743 0.7141 10.5155 4.1516 0.0782 0.0894 0.3708 0.6034 0.6974 0.3733 0.7702 0.5512 0.1194 2.4514 1.7941 2.8619 1.1956 0.6902 0.3094 0.4184 0.1885 0.3820 10.5692 8.6787 4.4381 9.1487 29.1780 2.7557 23.2260 4.0052 0.5619 0.8398 12.9904 16.6515 1.2035 8.2683 32.1783 21.8833 9.2626 6.8412 5.2564 0.1018 3.1924 0.2710 15.6388 12.5834 21.6201 33.1457 50.0358 43.7057 26.7963 28.1664 19.0328
temp: 298.150 k
press: 1.00000 atm
elementType: 6 6 6 6 6 6 6 6 6 6 6 6 6 6 6 6 6 6 6 6 1 1 1 1 1 1 1 1 1 1 1 1 1 1 1 1 1 1
symmnumber: 1
zpe: 824029.8 jmol-1
zpe.correction: 0.313856 hartree
zpe.thermalcorrener: 0.330358 hartree
zpe.thermalcorrenthalpy: 0.331302 hartree
zpe.thermalcorrgfe: 0.267125 hartree
zpe.sumelectzpe: -771.546204 hartree
zpe.sumelectthermal: -771.529702 hartree
zpe.sumelectthermalent: -771.528758 hartree
zpe.sumelectthermalfe: -771.592936 hartree
dipole: 0.0611 0.0484 0.0640
dipole: 0.1009
quadrupole: -109.8329 -115.1429 -111.2557
quadrupole: -3.6288 -4.2590 -2.4316
quadrupole: 2.2443 -3.0657 0.8215 -3.6288 -4.2590 -2.4316
hfenergy: -771.8600605 hartree
pointgroup: C01[X(C20H18)]
dipole: 0.025346 -0.0156876 -0.0262077 debye
polarizability: 248.2965264|23.926168|192.5960614|21.1210946|-6.3447866|164.5618259 unknown
InChI: InChI=1S/C20H18/c1-4-10-17(11-5-1)16-20(18-12-6-2-7-13-18)19-14-8-3-9-15-19/h1-15,20H,16H2
charge 0 multiplicity 1
38 atoms
C  0.431055 0.488657 -0.252807
C  -0.483156 1.169452 0.825171
C  0.252925 -1.038497 -0.237828
C  1.910027 0.886061 -0.12647
C  -1.965398 1.063641 0.500213
C  0.890668 -1.835815 0.748053
C  2.765323 0.698865 -1.244884
C  -0.582211 -1.676006 -1.188276
C  2.471389 1.41275 1.064141
C  -2.56257 1.974636 -0.410571
C  -2.778089 0.053742 1.074623
C  0.694493 -3.233623 0.784136
C  4.135502 1.028439 -1.179985
C  -0.77815 -3.076064 -1.158611
C  3.845239 1.743111 1.135533
C  -0.140871 -3.860655 -0.170952
C  4.683486 1.552951 0.014987
C  -3.933102 1.879979 -0.739901
C  -4.150175 -0.045142 0.749474
C  -4.733191 0.867746 -0.159448
H  0.075534 0.849676 -1.239187
H  -0.193782 2.236318 0.890683
H  -0.280063 0.711096 1.811538
H  1.559296 -1.36126 1.47637
H  2.349162 0.2835 -2.171378
H  -1.089342 -1.071777 -1.950556
H  1.840792 1.576233 1.944581
H  -1.949976 2.769439 -0.855949
H  -2.330458 -0.661281 1.775293
H  1.198664 -3.835546 1.549143
H  4.775252 0.878126 -2.057148
H  -1.427915 -3.551019 -1.90257
H  4.258346 2.150465 2.065621
H  -0.288895 -4.946289 -0.147058
H  5.747101 1.810903 0.069169
H  -4.378292 2.596235 -1.440196
H  -4.762316 -0.832508 1.203985
H  -5.797601 0.794162 -0.409837
