program: Gaussian 09
title: 000137038
version: EM64L-G09RevD.01
frameworkgroup: C1[X(C3H5Cl2OP)]
method: RPBEPBE
basis: SDD
operation: Freq
keyword: #p
keyword: freq=noraman
keyword: PBEPBE/SDD
title: #p freq=noraman PBEPBE/SDD
converged: YES YES NO NO
title: Mulliken charges:
elementType: Cl Cl P O C C C H H H H H
charge: -0.181406 -0.174792 0.798745 -0.511874 -0.797071 0.013127 -0.496601 0.318146 0.307008 0.254562 0.237790 0.232364
chargesum: 0.00000
title: Mulliken charges with hydrogens summed into heavy atoms:
elementType: Cl Cl P O C C C
charge: -0.181406 -0.174792 0.798745 -0.511874 -0.171916 0.267689 -0.026447
polarizability: 1.13915123e+02 8.98410797e+00 7.78027854e+01 3.56949452e+00 -6.48119336e+00 6.59723159e+01
1716.lowfreq: -11.7842 -3.8310 0.0019 0.0023 0.0033 9.6110 48.9937 64.4487 117.6780
frequency: 48.9876 64.4413 117.6755 131.6148 182.2724 214.1022 232.3892 278.5511 386.0435 405.8736 438.4762 554.6799 710.9652 872.2064 936.7496 972.1060 998.2937 1038.5183 1100.6311 1203.0917 1252.0801 1300.1770 1399.8546 1433.6190 1642.6948 3027.9448 3102.0602 3116.8917 3138.1395 3214.6081
redmass: 3.9344 4.0851 5.2409 6.9519 4.3862 5.5363 14.1780 7.3526 5.7429 2.0023 9.1526 3.1495 2.2530 1.4275 2.1200 1.3028 1.1739 6.1317 1.6317 1.3909 1.2124 1.2045 1.1020 1.1878 4.2866 1.0602 1.0606 1.1018 1.0965 1.1153
irintensity: 0.3145 0.3767 0.1362 1.3646 2.0997 19.5758 5.2817 5.7876 48.7438 11.8983 131.5627 45.2256 19.5439 11.1446 5.3136 72.9111 7.4138 62.1340 24.4541 1.6683 7.6937 0.9467 18.6513 16.6732 4.7120 1.5684 2.7229 0.9790 4.4461 11.7903
temp: 298.150 k
press: 1.00000 atm
elementType: 17 17 15 8 6 6 6 1 1 1 1 1
symmnumber: 1
zpe: 200468.6 jmol-1
zpe.correction: 0.076354 hartree
zpe.thermalcorrener: 0.085789 hartree
zpe.thermalcorrenthalpy: 0.086733 hartree
zpe.thermalcorrgfe: 0.040044 hartree
zpe.sumelectzpe: -1453.323485 hartree
zpe.sumelectthermal: -1453.314050 hartree
zpe.sumelectthermalent: -1453.313106 hartree
zpe.sumelectthermalfe: -1453.359796 hartree
dipole: 3.9232 -1.8831 -2.4421
dipole: 4.9901
quadrupole: -60.3964 -63.9217 -68.4366
quadrupole: -1.4356 0.0894 0.0747
quadrupole: 3.8552 0.3299 -4.1850 -1.4356 0.0894 0.0747
hfenergy: -1453.3998392 hartree
pointgroup: C01 [X(C3H5Cl2O1P1)]
dipole: -1.7241072 0.6464369 -0.6811027 debye
dipolederiv: -0.8004852 -0.134162 0.234179 -0.2202259 -0.3406727 0.1343121 0.3871875 0.1569238 -0.4730272 -0.2637334 -0.0964665 -0.027333 0.1384714 -0.8357292 -0.1165692 -0.0283946 -0.1817378 -0.2826921 1.3790998 0.2739797 -0.2055354 0.1274261 1.6820219 0.0099891 -0.3771542 0.0656206 1.3261975 -0.5585944 -0.0048182 0.0052087 0.0495901 -0.53311 -0.0386013 -0.0283083 -0.055326 -0.6354841 0.4039381 -0.1528189 0.0208018 -0.1721174 -0.1212571 0.0048472 0.1205091 -0.0479207 -0.1384624 -0.2809168 0.0845936 -0.0319893 -0.0301523 -0.1107036 0.1216515 -0.2989871 0.1604534 0.0493279 -0.0307222 0.0858999 -0.143897 0.2107775 -0.1638663 0.1206448 0.0063856 0.0986121 0.0090305 -0.0277956 0.0298311 -0.0000084 -0.0261774 -0.0003347 0.0009665 -0.0222433 0.0246707 0.1132226 0.0060847 0.0070382 -0.0211704 0.0406129 0.0728624 -0.0474245 0.0158825 -0.0231466 -0.0067727 0.0542845 -0.0411318 0.0111592 -0.0237676 0.0979681 -0.0841331 0.0679892 -0.0872097 -0.0088456 0.019234 -0.0499523 0.088702 -0.1077769 0.1533702 -0.0200413 0.1281045 -0.0213401 0.0654207 0.0996064 -0.001993 0.0698828 0.0133395 0.0994511 -0.0856417 0.0290291 -0.0895998 -0.0179153 unknown
polarizability: 109.9859132|13.0718143|79.0537872|-10.1234333|4.8573925|68.6505235 unknown
InChI: InChI=1S/C3H5OP.2Cl/c1-2-3-5-4;;/h2H,1,3H2;;
charge 0 multiplicity 1
12 atoms
Cl 2.598515 0.707573 -1.139839
Cl 0.665357 -2.167105 -0.410946
P  0.917633 -0.00324 0.219581
O  1.177672 0.209724 1.766616
C  -0.600971 0.857861 -0.552113
C  -1.850391 0.566036 0.228435
C  -2.817635 -0.285227 -0.201702
H  -0.327096 1.928493 -0.536911
H  -0.636735 0.501435 -1.593112
H  -1.954965 1.079297 1.192673
H  -3.721363 -0.459408 0.391675
H  -2.732922 -0.828038 -1.150557
