program: Gaussian 09
title: 000011542
version: EM64L-G09RevD.01
frameworkgroup: C1[X(C7H16)]
method: RPBEPBE
basis: SDD
operation: Freq
keyword: #p
keyword: freq=noraman
keyword: PBEPBE/SDD
title: #p freq=noraman PBEPBE/SDD
converged: YES YES NO NO
title: Mulliken charges:
elementType: C C C C C C C H H H H H H H H H H H H H H H H
charge: 0.323152 -0.355551 -0.395041 -0.728905 -0.729205 -0.717918 -0.694258 0.183920 0.184017 0.207178 0.207429 0.207876 0.214562 0.206841 0.206785 0.207905 0.214811 0.208224 0.208131 0.208279 0.208633 0.214535 0.208598
chargesum: 0.00000
title: Mulliken charges with hydrogens summed into heavy atoms:
elementType: C C C C C C C
charge: 0.323152 0.012386 0.019566 -0.099625 -0.099704 -0.093284 -0.062491
polarizability: 8.54317692e+01 3.80413958e-01 7.19228216e+01 -9.76583088e-03 5.00084937e-04 7.16209006e+01
1716.lowfreq: -16.4086 -0.0006 0.0007 0.0007 8.4679 19.1654 56.0474 94.4890 182.3169
frequency: 55.7645 94.3942 182.3059 195.5679 234.5349 235.4306 247.5319 307.8177 322.4617 331.8791 399.2000 413.5894 486.0890 733.5779 734.7962 853.8843 875.4027 922.8128 925.1492 937.7133 946.7201 996.7525 1008.8004 1055.9066 1081.8389 1105.3143 1212.9022 1213.6159 1255.0629 1268.9834 1295.2936 1311.0085 1351.3244 1369.6363 1376.4804 1387.8805 1400.4847 1450.1053 1458.2139 1464.7331 1464.9432 1472.8389 1476.8330 1484.5505 1485.0142 1485.2466 1494.8071 2941.6011 2961.6827 2965.2999 2969.5120 2971.4602 2979.5993 2991.5307 3031.4589 3055.9471 3058.1223 3060.1439 3066.1265 3067.5287 3069.1457 3069.5526 3072.8499
redmass: 1.5947 2.0027 2.6545 1.0976 1.0443 1.1031 1.0770 2.5399 2.0700 2.4681 2.0342 2.3212 2.4757 3.1081 1.1445 1.2777 1.9087 1.6747 1.6644 1.2046 1.9876 1.2806 1.4201 2.5165 1.3901 2.1075 2.2575 1.9086 2.9629 1.4282 1.4689 1.2780 1.5109 1.2188 1.2081 1.2117 1.2137 1.0753 1.0500 1.0474 1.0526 1.0614 1.0428 1.0568 1.0613 1.0739 1.0606 1.0585 1.0346 1.0352 1.0353 1.0369 1.0589 1.0998 1.1019 1.1001 1.0997 1.0997 1.0986 1.0994 1.0992 1.1002 1.0979
irintensity: 0.0214 0.0005 0.1134 0.0002 0.0033 0.0045 0.0018 0.1106 0.0103 0.0712 0.0421 0.1451 0.8019 0.8071 7.1809 0.4302 1.7008 1.5047 4.3997 0.0498 7.7110 0.0073 1.4262 0.6564 0.0694 2.5298 7.1396 4.1800 16.2688 1.9262 4.6525 2.0713 3.8178 19.3521 26.4751 7.4081 13.7048 0.3105 0.2419 1.0429 0.8739 1.2559 16.9905 11.1719 4.2228 9.5518 29.3441 33.7518 40.0359 46.6209 54.4844 4.1511 34.7471 12.6437 17.3286 0.3777 2.7106 20.9891 100.3549 106.4700 41.1050 33.6383 105.7409
temp: 298.150 k
press: 1.00000 atm
elementType: 6 6 6 6 6 6 6 1 1 1 1 1 1 1 1 1 1 1 1 1 1 1 1
symmnumber: 1
zpe: 557440.4 jmol-1
zpe.correction: 0.212318 hartree
zpe.thermalcorrener: 0.222250 hartree
zpe.thermalcorrenthalpy: 0.223195 hartree
zpe.thermalcorrgfe: 0.178233 hartree
zpe.sumelectzpe: -275.733473 hartree
zpe.sumelectthermal: -275.723540 hartree
zpe.sumelectthermalent: -275.722596 hartree
zpe.sumelectthermalfe: -275.767557 hartree
dipole: -0.0017 -0.0051 -0.0001
dipole: 0.0054
quadrupole: -48.2539 -48.0143 -47.5932
quadrupole: 0.0472 0.0018 0.0011
quadrupole: -0.3001 -0.0605 0.3606 0.0472 0.0018 0.0011
hfenergy: -275.9457904 hartree
pointgroup: C01 [X(C7H16)]
dipole: -0.0006921 -0.0019889 -0.0001077 debye
dipolederiv: 0.133847 0.003886 0.0003316 -0.0365573 0.1219835 -0.000686 -0.0009373 -0.0008518 0.1497338 -0.0136866 -0.0152171 0.0004356 -0.0105731 0.0554233 -0.0023756 0.0003145 -0.0026424 0.1264562 -0.0123002 -0.0085961 0.0009207 0.0323835 0.0683286 -0.003836 0.0023855 -0.0036909 0.1673759 0.0230165 0.0101359 -0.0138886 0.0291997 -0.0077531 0.0689404 -0.0102721 0.0625824 -0.0368269 0.0235325 0.0082589 0.0135194 0.027442 0.0001162 -0.067193 0.0111081 -0.0604326 -0.0455846 -0.0287183 -0.0750152 -0.0019553 -0.0483782 -0.0245809 -0.0023216 -0.0009869 -0.0020633 0.0532116 -0.052708 0.0363239 0.0022313 0.0029818 0.0686181 -0.0010591 0.0011639 -0.0011748 0.0946684 0.025718 0.0109012 0.0209149 0.0058151 -0.0342809 -0.1160306 0.037353 -0.1478266 -0.1109746 0.0250692 0.0141393 -0.0215692 0.0100054 -0.0537033 0.119944 -0.0383368 0.1517114 -0.0910083 0.0477295 0.0271902 -0.0280159 0.0128187 -0.0544848 0.1166717 -0.0201232 0.1351913 -0.0745823 0.0484426 0.0232195 0.0280782 0.0096642 -0.0359233 -0.1137374 0.0192184 -0.132468 -0.0937631 0.0895365 0.0266692 0.0546317 0.0217418 0.0091156 -0.1345967 0.0305318 -0.0770731 -0.1304431 0.012195 -0.149938 0.0171993 -0.1366298 -0.0963343 0.0248032 -0.0028758 -0.0039465 0.0674466 -0.1865355 0.1063915 -0.0392678 0.0693538 0.0618242 0.0173191 0.0136489 0.0032447 0.0773852 -0.1860554 0.1034707 0.0499129 0.0696156 0.0632371 -0.0192059 -0.0053732 -0.0056271 0.0755496 0.0882414 0.031336 -0.0561356 0.0259288 -0.0046643 0.1419007 -0.0324723 0.0845198 -0.1152499 0.0120073 -0.1484431 -0.0257161 -0.1370522 -0.0942084 -0.0327702 -0.0048717 -0.0040251 0.0658087 0.0822232 0.0249184 0.0510935 -0.007943 -0.0105066 -0.1066062 0.0113009 -0.1497222 -0.1032335 -0.1987593 0.0360399 0.0030179 0.1012848 0.0453464 -0.0021633 0.0051745 -0.0017014 0.0922702 0.0811787 0.0301453 -0.0517083 -0.0056935 -0.0271662 0.1116221 -0.0141452 0.1541552 -0.0857472 0.0662174 0.0086489 0.0063932 0.063895 -0.0202276 0.1252809 -0.0458684 0.1357865 -0.0806483 -0.1471243 -0.1115648 -0.0022583 -0.1579984 -0.0280083 -0.0032822 -0.003796 -0.0036184 0.0975663 0.0669327 0.0070996 -0.008165 0.058695 -0.0021511 -0.1206183 0.0478593 -0.1303272 -0.0994106 unknown
polarizability: 85.4329949|0.3498783|71.9206317|-0.0775458|0.0105424|71.6218648 unknown
InChI: InChI=1S/C7H16/c1-5-6-7(2,3)4/h5-6H2,1-4H3
charge 0 multiplicity 1
23 atoms
C  0.939289 0.021707 -0.007563
C  -0.514536 0.593304 0.021487
C  -1.671327 -0.43216 -0.009074
C  1.202701 -0.87652 1.230878
C  1.183455 -0.79664 -1.304034
C  1.926391 1.220572 0.023388
C  -3.05537 0.253822 0.025354
H  -0.62278 1.218593 0.933785
H  -0.63281 1.283059 -0.841821
H  -1.587639 -1.122711 0.852999
H  -1.599114 -1.05653 -0.921165
H  1.008654 -0.323231 2.169814
H  0.562697 -1.777751 1.22756
H  2.256115 -1.21539 1.248654
H  2.236291 -1.133128 -1.35909
H  0.975057 -0.185298 -2.203064
H  0.542893 -1.696375 -1.347277
H  1.784792 1.826314 0.938774
H  2.976023 0.870821 0.005298
H  1.773015 1.883167 -0.84978
H  -3.18623 0.926954 -0.843194
H  -3.875787 -0.487216 0.005339
H  -3.172879 0.864036 0.941032
