program: Gaussian 09
title: 000139435
version: EM64L-G09RevD.01
frameworkgroup: C1[X(C12H9ClS)]
method: RPBEPBE
basis: SDD
operation: Freq
keyword: #p
keyword: freq=noraman
keyword: PBEPBE/SDD
title: #p freq=noraman PBEPBE/SDD
converged: YES YES NO NO
title: Mulliken charges:
elementType: Cl S C C C C C C C C C C C C H H H H H H H H H
charge: -0.061332 0.240269 -0.196608 -0.205109 -0.146544 -0.244573 -0.209804 -0.263801 -0.216969 -0.200006 -0.098197 -0.215988 -0.206891 -0.231196 0.266276 0.251224 0.264668 0.258703 0.257104 0.257937 0.233756 0.233522 0.233559
chargesum: 0.00000
title: Mulliken charges with hydrogens summed into heavy atoms:
elementType: Cl S C C C C C C C C C C C C
charge: -0.061332 0.240269 -0.196608 -0.205109 0.119732 0.006650 0.054864 -0.005098 0.040134 0.057931 -0.098197 0.017768 0.026631 0.002363
polarizability: 2.32132605e+02 1.04611011e+01 1.36540183e+02 1.65489043e+01 5.36348791e-01 9.62731188e+01
1716.lowfreq: -20.3670 -9.6513 -1.1866 -0.0040 -0.0036 -0.0009 4.1732 28.6233 50.2322
frequency: -15.9496 28.5968 50.1977 96.5541 168.4179 211.4686 251.9957 274.2399 308.1109 347.1314 401.5563 407.1106 414.1425 473.9518 488.7380 516.6009 609.5812 620.1140 676.6405 692.5239 695.7104 711.1117 754.5344 816.8785 820.5896 849.7088 922.9032 944.1194 959.6122 977.2974 984.8079 989.6766 997.5512 1014.8578 1060.8517 1070.9633 1072.3891 1078.4595 1106.4202 1172.5114 1182.3723 1183.3302 1287.0510 1301.2550 1355.9912 1374.2766 1386.0485 1425.8324 1456.2402 1459.2791 1576.9817 1578.4396 1586.6876 1587.9018 3130.3126 3139.4949 3145.3930 3150.6113 3151.9436 3160.1869 3171.1201 3171.3201 3174.4083
redmass: 4.4144 4.2554 6.0207 9.0194 6.2083 6.8882 5.9530 7.8541 5.8006 9.2979 2.9877 2.9285 6.2227 3.1472 6.1074 5.0219 6.4735 7.1699 6.7088 3.3760 2.4838 6.9130 1.5215 1.4533 1.2496 1.2451 1.3672 1.3204 1.3635 1.4003 6.1114 5.5606 1.3180 3.3438 3.4024 2.8560 1.6023 2.3780 1.3570 1.0539 1.1175 1.1210 1.2414 1.3240 4.8471 8.9819 4.0750 2.0954 2.1208 2.1081 7.3686 6.4595 6.3883 6.0019 1.0850 1.0884 1.0893 1.0890 1.0924 1.0968 1.1000 1.0977 1.0972
irintensity: 0.7785 0.2709 0.1263 0.5388 1.0798 0.6072 1.6190 1.2520 0.2012 1.5749 0.9309 0.4263 2.1539 32.6664 30.1276 10.6934 0.1958 0.0387 9.1682 11.7905 29.3321 8.3762 64.5712 64.7566 0.4651 0.4226 1.7605 0.1587 0.5445 0.1592 27.6327 65.3928 0.4162 14.9398 15.0901 38.0978 6.9318 13.5248 7.2815 0.0296 1.4637 1.6118 0.6886 0.7995 2.6101 0.8302 3.3810 9.7674 136.1392 17.4364 1.0005 5.3855 4.5153 9.3943 0.3375 5.2502 2.9694 4.5390 12.4612 20.1850 7.8129 15.5771 1.0256
temp: 298.150 k
press: 1.00000 atm
elementType: 17 16 6 6 6 6 6 6 6 6 6 6 6 6 1 1 1 1 1 1 1 1 1
symmnumber: 1
zpe: 443665.7 jmol-1
zpe.correction: 0.168983 hartree
zpe.thermalcorrener: 0.180401 hartree
zpe.thermalcorrenthalpy: 0.181346 hartree
zpe.thermalcorrgfe: 0.129670 hartree
zpe.sumelectzpe: -1319.820118 hartree
zpe.sumelectthermal: -1319.808700 hartree
zpe.sumelectthermalent: -1319.807756 hartree
zpe.sumelectthermalfe: -1319.859431 hartree
dipole: -2.4488 -0.8744 0.1235
dipole: 2.6032
quadrupole: -94.9737 -92.1877 -93.5061
quadrupole: 10.5410 4.5106 0.4717
quadrupole: -1.4179 1.3682 0.0497 10.5410 4.5106 0.4717
hfenergy: -1319.9891016 hartree
pointgroup: C01 [X(C12H9Cl1S1)]
dipole: -0.9783319 -0.302899 -0.0057284 debye
dipolederiv: -0.7958338 0.2792098 0.0511479 0.3666802 -0.2610643 -0.0577354 0.0613708 -0.0526844 -0.0947661 -0.5444085 0.0403166 -0.0216572 0.15993 0.0096143 0.0039987 -0.2300826 -0.0022376 -0.0695516 0.8635053 -0.3294096 -0.0669459 -0.5758503 -0.0501772 0.0374851 0.0522104 0.0501952 -0.0454042 0.4664937 0.3047737 0.0594614 0.4701936 0.0479695 -0.037335 0.2010151 -0.0406626 -0.0091148 -0.2525833 0.0844182 0.0630158 0.2163781 -0.0890515 0.021435 0.0194698 0.0402021 -0.0706343 -0.3099669 0.0480327 0.0278135 0.1118627 0.027152 0.0912154 0.08706 0.0859972 -0.0672596 -0.1909771 -0.0653246 0.1041725 -0.1635751 -0.1602849 0.0109011 -0.0326538 -0.0521938 -0.024784 -0.2599918 -0.0200929 -0.0283713 -0.1196667 -0.0416273 -0.1035438 0.0702757 -0.0507306 -0.0404295 -0.1714782 0.0613836 0.0228374 0.0925185 -0.0332168 0.0543925 0.0407305 0.0519617 -0.0600396 -0.154041 0.0937907 0.0629648 0.0941425 -0.0801427 0.0324733 0.0347702 0.0281031 -0.0690324 1.0002311 -0.4590662 -0.070144 -0.5312715 0.2624554 0.1121091 -0.085805 0.1059073 -0.0276876 -0.047681 0.0618162 0.0113588 0.0349343 0.0336607 -0.1291112 0.0580024 -0.0942024 -0.0037389 -0.0042048 0.0056192 0.1382097 0.0388062 -0.069235 -0.0212424 0.1243024 -0.043109 0.0154805 -0.0383678 0.1179927 0.0470341 0.0863577 -0.0109497 -0.0228357 0.0228553 -0.0283153 -0.0912033 0.0259034 -0.0266604 -0.0677382 -0.0455765 0.0654384 -0.0314025 -0.08823 -0.0391248 0.099831 0.1036166 0.0515602 0.0083893 0.0158384 -0.0008014 -0.0972487 0.0062053 -0.0876577 0.0946979 0.0602598 -0.0043698 -0.1082484 -0.0000969 0.0968691 0.006974 -0.1138725 0.0198561 0.0413554 0.149603 -0.044967 0.0012008 -0.0241312 0.0242752 0.0963523 0.0018344 0.0787892 0.0472386 0.0720831 0.0186335 -0.0004958 0.0279177 0.0121539 -0.0918652 0.0105477 -0.0864292 0.1061796 -0.0259864 -0.0421847 -0.0604468 -0.0236876 0.0990872 -0.0496699 -0.060756 -0.0491882 0.1234301 0.0796639 -0.0366587 -0.0174928 -0.0632485 -0.0048011 0.1218507 0.0024165 0.1208997 0.0253282 -0.0103 -0.0165459 -0.1204738 -0.0275064 0.1034155 0.0390385 -0.1420834 0.0335482 0.0051866 -0.0155393 -0.1222672 -0.0355917 -0.1409493 0.0192604 0.0137641 -0.0395829 0.0110758 0.114918 unknown
polarizability: 232.8528027|2.9925954|134.6449858|17.5159698|6.5989817|97.4481186 unknown
InChI: InChI=1S/C12H9ClS/c13-10-6-8-12(9-7-10)14-11-4-2-1-3-5-11/h1-9H
charge 0 multiplicity 1
23 atoms
Cl 5.04637 -1.258116 -0.305346
S  -0.578097 1.885097 0.320734
C  0.982006 0.91606 0.150188
C  -1.877035 0.583342 0.15088
C  1.058984 -0.292285 -0.581147
C  2.148218 1.462449 0.740088
C  -1.971476 -0.473004 1.088057
C  -2.826046 0.707732 -0.889533
C  2.296167 -0.961248 -0.715758
C  3.391721 0.807119 0.597088
C  3.445688 -0.399008 -0.127631
C  -3.015131 -1.417928 0.969712
C  -3.879113 -0.232495 -0.990891
C  -3.972968 -1.297399 -0.06606
H  0.163487 -0.717605 -1.04448
H  2.091757 2.391834 1.316584
H  -1.238164 -0.552164 1.897274
H  -2.737202 1.525452 -1.611976
H  2.360438 -1.897714 -1.277304
H  4.294426 1.225578 1.051084
H  -3.086363 -2.238088 1.692521
H  -4.616339 -0.134363 -1.795196
H  -4.785926 -2.027046 -0.14899
