program: Gaussian 09
title: 000139428
version: EM64L-G09RevD.01
frameworkgroup: C1[X(C10H11NO)]
method: RPBEPBE
basis: SDD
operation: Freq
keyword: #p
keyword: freq=noraman
keyword: PBEPBE/SDD
title: #p freq=noraman PBEPBE/SDD
converged: YES YES NO NO
title: Mulliken charges:
elementType: O N C C C C C C C C C C H H H H H H H H H H H
charge: -0.279139 -0.385469 0.478618 -0.511763 -0.441615 -0.370492 -0.216886 -0.223643 -0.241218 0.263403 -0.223660 -0.486129 0.227014 0.268266 0.231674 0.249667 0.296111 0.227090 0.227601 0.229955 0.207999 0.221081 0.251536
chargesum: 0.00000
title: Mulliken charges with hydrogens summed into heavy atoms:
elementType: O N C C C C C C C C C C
charge: -0.279139 -0.089358 0.478618 -0.016483 -0.209941 -0.120825 0.010203 0.003958 -0.011263 0.263403 -0.015661 -0.013513
polarizability: 1.75539120e+02 -1.12741591e+01 1.01322032e+02 -1.26403474e+01 4.35298037e+00 7.46834780e+01
1716.lowfreq: -7.5814 -2.8221 0.0004 0.0005 0.0008 10.1007 24.5605 32.2144 57.9311
frequency: 23.9184 32.0861 57.9172 116.0012 179.0368 205.1537 267.0712 275.2095 341.9357 403.2959 446.0827 501.2148 524.3970 573.6578 595.9566 617.2345 646.9355 705.0296 753.4579 782.2314 804.0041 855.0227 864.1661 916.9027 978.0293 981.9532 989.8519 993.0718 994.8505 1002.1328 1025.8225 1054.4815 1058.8468 1088.4275 1172.4106 1186.3333 1200.9788 1213.3826 1229.8573 1303.7810 1318.5711 1351.8826 1386.3537 1404.7587 1441.5880 1472.1447 1480.6507 1486.7461 1595.1202 1597.2070 1614.8997 1649.1043 2980.2115 3039.8369 3092.7338 3109.7451 3115.5529 3124.2752 3135.9688 3147.0779 3163.9411 3217.7053 3546.9988
redmass: 4.4103 4.1182 4.9955 2.7612 4.1944 2.9334 4.0371 3.8995 2.8206 2.8031 2.9947 1.7661 3.9450 1.5922 2.1360 6.2020 3.4624 1.8394 1.8001 3.5850 3.7833 1.2573 2.6807 1.3966 1.3901 1.3135 5.8830 1.1546 1.4064 1.8521 2.2130 2.9069 2.0722 1.5958 1.0544 1.1243 1.8006 2.4484 1.2746 1.3716 1.3724 1.4155 5.6437 1.2080 2.1439 1.2448 1.9846 1.7928 6.0592 7.0133 6.0348 4.6916 1.0617 1.0991 1.0695 1.0837 1.0873 1.0861 1.0913 1.0962 1.1015 1.1163 1.0777
irintensity: 3.2089 1.8472 7.3598 0.5326 2.1580 1.6352 8.4977 0.6698 11.7067 0.5771 2.7060 19.4086 12.9552 51.1833 68.5817 0.9946 3.6024 49.0214 47.8922 24.0922 11.7778 0.1111 4.9240 3.1397 0.2542 0.4017 0.2121 85.8262 5.2384 5.7583 10.2081 3.5212 6.7573 16.3319 0.1060 6.0068 73.9937 1.9331 86.5567 3.7418 13.0373 4.5531 5.6737 36.0169 23.0040 68.2382 145.9875 55.5997 4.1410 116.5853 7.2469 20.2131 41.3766 14.2760 10.0605 13.6389 8.9466 0.8379 12.7908 40.1003 22.4843 7.9210 19.7596
temp: 298.150 k
press: 1.00000 atm
elementType: 8 7 6 6 6 6 6 6 6 6 6 6 1 1 1 1 1 1 1 1 1 1 1
symmnumber: 1
zpe: 487090.7 jmol-1
zpe.correction: 0.185523 hartree
zpe.thermalcorrener: 0.196755 hartree
zpe.thermalcorrenthalpy: 0.197699 hartree
zpe.thermalcorrgfe: 0.146293 hartree
zpe.sumelectzpe: -516.761070 hartree
zpe.sumelectthermal: -516.749838 hartree
zpe.sumelectthermalent: -516.748894 hartree
zpe.sumelectthermalfe: -516.800300 hartree
dipole: 1.3523 0.4214 -3.4830
dipole: 3.7599
quadrupole: -65.2058 -66.2367 -74.0605
quadrupole: -4.1690 7.0165 2.1318
quadrupole: 3.2952 2.2643 -5.5595 -4.1690 7.0165 2.1318
hfenergy: -516.9465931 hartree
pointgroup: C01 [X(C10H11N1O1)]
dipole: 0.4701082 -0.3892462 -1.3474964 debye
dipolederiv: -0.7477157 0.0778051 0.0022762 0.1772039 -0.4085842 -0.1013217 0.1974088 -0.1224329 -0.9175881 -1.3365251 0.1643931 0.2269078 0.147394 -0.5467395 -0.0414812 0.1023733 0.0215202 -0.3210809 0.2159119 0.0700878 -0.1044523 0.1094376 -0.0463365 0.0010074 -0.210319 0.0120841 -0.0119132 0.4739927 -0.010269 0.0725499 0.1087865 0.3222922 -0.0822959 0.4750215 -0.1014979 0.1226514 -0.178582 -0.016288 -0.0034431 -0.0460837 0.0815941 -0.0472477 -0.0151017 -0.0581296 -0.1553221 -0.0725443 -0.0840414 -0.0118653 -0.1496989 -0.0470497 0.0095451 0.0130661 0.0168794 -0.1536988 0.0611574 -0.0792857 -0.0439245 -0.1017467 0.0096189 -0.0065596 -0.0188566 -0.0105513 -0.1360127 -0.0286072 -0.0014361 -0.0275741 0.0163002 0.1246829 -0.0528598 -0.0316907 -0.0488929 -0.1314437 0.0104174 0.0584044 -0.0655478 0.06016 -0.0580219 -0.0355993 -0.0545175 -0.0369975 -0.1485348 1.5425136 -0.42563 -0.1495106 -0.5868608 0.4324885 0.2067114 -0.1788097 0.1257714 0.9782343 -0.3358317 0.0066607 -0.1319384 0.0592436 -0.1787164 0.0913169 -0.091685 0.0874874 0.0299401 -0.0672333 -0.0976404 0.071437 -0.109709 -0.2386355 0.032368 -0.0438416 0.0622965 0.0532687 -0.0547407 0.0800052 -0.0256463 0.0283973 -0.1592022 0.0552562 -0.0858362 0.0128255 0.0953534 0.10229 -0.0282538 0.0715932 -0.0612794 0.0854015 -0.0519231 -0.0731137 -0.009749 0.0284689 0.1007905 -0.0425625 0.0220851 -0.0145446 -0.1100858 0.0515629 0.0129477 0.056908 0.1382509 -0.0126039 0.0928907 0.0275483 0.1145116 0.0427003 0.0001483 0.0392564 -0.0025585 0.1328246 0.2204742 0.0725318 -0.0184599 0.1126106 0.2915947 -0.0224811 -0.0811007 -0.0136759 0.0816829 -0.073926 0.1008374 0.0335133 0.1095018 0.0172004 -0.0003816 0.0413643 0.0010791 0.1491865 0.0747978 -0.0071033 0.0187807 -0.0321157 -0.1150062 0.0544475 0.0186337 0.0524099 0.1408498 -0.0831808 -0.0712085 0.0717633 -0.0771073 0.0557763 0.0386579 0.0773302 0.0392181 0.1377982 0.0446714 0.0663634 0.0526127 0.0569801 0.1303491 -0.0732514 -0.0188021 -0.0511942 -0.1120848 -0.0022228 0.0482778 -0.0910789 0.0503406 0.1492352 0.0105213 -0.1117497 0.0164792 0.0073327 0.1466966 0.0254613 0.0023738 0.0282784 0.1654438 -0.0361405 0.0380222 -0.0492792 -0.0081633 unknown
polarizability: 174.1446244|-17.0016915|101.0545737|-11.4103533|-5.6531541|76.3454324 unknown
InChI: InChI=1S/C10H11NO/c1-2-10(12)11-8-9-6-4-3-5-7-9/h2-7,11H,1,8H2
charge 0 multiplicity 1
23 atoms
O  -2.606985 0.116266 1.536216
N  -1.278737 -0.787085 -0.156462
C  1.167499 -0.500996 0.260997
C  -0.148982 -1.112719 0.728743
C  2.326847 -1.303364 0.126425
C  1.255598 0.886298 -0.024646
C  3.555297 -0.733248 -0.281668
C  2.479746 1.457497 -0.434204
C  3.634854 0.649131 -0.563907
C  -2.443954 -0.187881 0.312018
C  -3.475368 0.064626 -0.746387
C  -4.669331 0.632589 -0.441768
H  -0.041599 -2.211759 0.818775
H  -0.440092 -0.726436 1.724134
H  2.26991 -2.377702 0.343192
H  0.362568 1.51377 0.080675
H  -1.188007 -0.996991 -1.152269
H  4.444769 -1.365612 -0.380858
H  2.536669 2.530868 -0.647843
H  4.58515 1.092956 -0.881102
H  -3.237891 -0.226033 -1.779787
H  -5.432555 0.822107 -1.203695
H  -4.885807 0.913118 0.59572
