program: Gaussian 09
title: 000139420
version: EM64L-G09RevD.01
frameworkgroup: C1[X(C7H12OSi)]
method: RPBEPBE
basis: SDD
operation: Freq
keyword: #p
keyword: freq=noraman
keyword: PBEPBE/SDD
title: #p freq=noraman PBEPBE/SDD
converged: YES YES NO NO
title: Mulliken charges:
elementType: Si O C C C C C C C H H H H H H H H H H H H
charge: 1.008805 -0.231290 -0.718397 -0.110021 -1.015288 -0.667224 -0.366027 -0.269747 -0.186747 -0.083768 0.240563 0.236773 0.238165 0.248659 0.248654 0.223731 0.217813 0.217461 0.258794 0.251796 0.257296
chargesum: 0.00000
title: Mulliken charges with hydrogens summed into heavy atoms:
elementType: Si O C C C C C C C
charge: 0.925037 -0.231290 -0.241061 -0.110021 -0.279810 -0.008219 -0.107233 -0.017951 0.070548
polarizability: 1.29426970e+02 -4.52471141e+00 7.79244953e+01 5.05520951e-01 4.03759208e-01 9.18995531e+01
1716.lowfreq: -8.9253 -0.0008 0.0012 0.0013 3.2546 13.8323 36.7485 62.5750 72.4924
frequency: 36.6534 62.4920 72.4574 110.2316 146.5584 168.6396 208.5963 248.6241 272.7124 293.4720 444.6414 592.0151 617.6189 632.6725 640.0515 692.0793 733.0193 741.4556 780.0300 822.7557 858.9164 870.9453 875.5881 880.3939 908.3027 989.2118 991.8297 997.7422 1025.5130 1031.2723 1095.2503 1127.1008 1194.4624 1237.8083 1249.5276 1301.6639 1338.9299 1392.1672 1442.2079 1449.9700 1451.1788 1453.8065 1483.2119 1486.9752 1537.0323 2096.8695 2971.7203 2985.7761 2988.1065 3038.4963 3062.9495 3071.3687 3091.6562 3096.1528 3213.2823 3228.6838 3262.6160
redmass: 4.0110 2.1794 3.9488 2.5098 1.0887 2.1699 1.3872 3.2946 3.5126 2.9770 5.5440 3.0592 3.5238 1.4640 2.2550 2.2156 1.2681 1.5087 1.2414 1.2590 2.5192 6.1296 1.7897 1.4140 1.2809 1.5471 1.6652 1.2443 2.5493 3.6516 3.9675 1.5405 1.4945 1.2211 1.4085 1.1927 2.2897 1.1857 1.0770 1.3020 2.9308 1.0598 1.0466 1.0422 5.1388 1.0406 1.0349 1.0593 1.0339 1.0998 1.0997 1.1002 1.0984 1.0986 1.0923 1.0974 1.1087
irintensity: 0.4317 0.0896 0.5021 0.3358 0.0323 1.0381 0.4446 7.5185 4.5627 3.8550 22.3055 5.4776 3.1622 3.0270 7.5938 17.8818 74.6273 85.4538 61.3464 27.8267 64.5491 0.2465 58.2756 15.1479 72.7065 7.3404 34.4874 9.0854 42.5227 4.8499 5.3096 15.5301 13.0492 2.0860 4.9400 30.7091 4.1306 6.7899 6.3382 11.5215 3.1583 11.4937 8.9922 11.2853 2.9888 109.8195 48.6579 12.6467 13.1332 1.1582 42.2520 51.6696 16.0429 13.6089 3.5957 1.2006 1.3054
temp: 298.150 k
press: 1.00000 atm
elementType: 14 8 6 6 6 6 6 6 6 1 1 1 1 1 1 1 1 1 1 1 1
symmnumber: 1
zpe: 443189.3 jmol-1
zpe.correction: 0.168802 hartree
zpe.thermalcorrener: 0.179959 hartree
zpe.thermalcorrenthalpy: 0.180903 hartree
zpe.thermalcorrgfe: 0.130969 hartree
zpe.sumelectzpe: -637.835161 hartree
zpe.sumelectthermal: -637.824003 hartree
zpe.sumelectthermalent: -637.823059 hartree
zpe.sumelectthermalfe: -637.872994 hartree
dipole: 0.0795 -0.1133 0.1709
dipole: 0.2199
quadrupole: -55.7337 -64.7879 -61.3503
quadrupole: -1.1540 0.1844 0.1990
quadrupole: 4.8902 -4.1639 -0.7263 -1.1540 0.1844 0.1990
hfenergy: -638.0039625 hartree
pointgroup: C01 [X(C7H12O1Si1)]
dipole: 0.0317464 0.0472006 -0.0652058 debye
dipolederiv: 1.6411916 0.0602539 -0.005844 0.0376017 1.1828021 -0.0072072 0.0298084 -0.0050417 0.9379487 -0.462928 -0.0577788 0.1218902 -0.0543019 -0.1388153 0.0177982 0.2088531 0.0312279 -0.5359718 -0.3738535 -0.0061825 -0.0015479 -0.1039201 -0.2125119 -0.0267137 -0.0299449 -0.0043754 -0.1397211 -0.3170685 0.0035645 -0.0435476 0.0377714 -0.3214932 -0.0050694 -0.002807 0.0017946 0.0972259 -0.402743 -0.0317789 0.0115147 0.0002671 -0.4085373 0.053641 0.0304366 0.0400241 -0.2590057 -0.0027537 -0.0415926 -0.0178639 0.1596702 0.0377332 -0.0096054 0.0959557 -0.0252437 0.0801663 -0.0687896 0.0264023 0.1090538 0.0195954 -0.1915727 0.0208402 -0.010764 0.0005286 0.0153173 -0.0507546 0.0288012 -0.0055192 0.0217462 -0.1918093 -0.0002615 -0.0003179 0.0013725 -0.1255468 0.1065807 0.0460325 -0.1449738 0.0404418 -0.1249678 -0.0223671 -0.21516 -0.0339472 0.1749392 -0.2945014 -0.0023696 0.009316 0.0091577 -0.2544125 0.0039767 -0.0217501 -0.0081838 -0.3088935 0.0328351 0.0041853 -0.0281388 -0.0101469 0.0845176 -0.0462574 -0.0554452 -0.0487633 -0.1205938 0.0394954 -0.0175731 0.0173483 -0.073725 -0.1250555 0.0835379 0.0167168 0.0722028 0.0583801 -0.153657 -0.0717882 -0.0202714 -0.1243002 0.0954369 -0.0051838 0.0168796 0.0094929 0.1020787 0.0765664 0.0911614 0.0362549 0.1215093 -0.0733032 -0.0657796 0.0189631 -0.0505944 0.0795538 0.1109273 0.0007785 -0.0281522 0.0026871 0.099926 0.0204839 -0.029004 0.0225132 -0.1100644 -0.1117504 0.1215734 0.0481905 0.1463952 -0.0695207 -0.0766192 0.0619614 -0.079705 0.0697992 0.0544207 -0.0125825 -0.0352894 -0.0309535 0.0964786 -0.0347453 -0.108735 -0.0180868 -0.1461163 0.0483961 -0.0571787 0.0169735 -0.1145739 -0.0753612 0.1104549 0.0389812 0.106266 0.0287376 0.1280363 -0.0103724 -0.041657 -0.0081808 0.1773179 -0.008826 -0.0263693 -0.0061984 -0.0327408 -0.0559166 -0.0449654 0.036918 -0.0464244 0.1986227 0.0056674 0.0364599 0.0058935 0.119279 0.0562669 -0.0285903 -0.0346545 -0.0303166 0.2145256 -0.0077646 -0.0547182 -0.0111764 0.0152285 unknown
polarizability: 129.3043915|5.1943793|78.0371612|0.2651466|0.0195468|91.9094661 unknown
InChI: InChI=1S/C7H12OSi/c1-3-9(2)7-5-4-6-8-7/h4-6,9H,3H2,1-2H3
charge 0 multiplicity 1
21 atoms
Si -1.17019 -0.404076 -0.542996
O  1.164589 0.017038 1.036514
C  -2.201654 1.047564 0.17611
C  0.681973 -0.079788 -0.304906
C  -1.661121 -2.068551 0.257161
C  -3.733244 0.855102 0.027467
C  1.760753 0.10416 -1.163735
C  2.946856 0.320186 -0.359382
C  2.545842 0.259426 0.963834
H  -1.365054 -0.472341 -2.042984
H  -1.934196 1.168394 1.244704
H  -1.884142 1.980896 -0.328748
H  -2.737589 -2.276169 0.117041
H  -1.089851 -2.901911 -0.188599
H  -1.449725 -2.052182 1.341761
H  -4.285034 1.724557 0.4308
H  -4.02675 0.738448 -1.033009
H  -4.084069 -0.040715 0.57307
H  1.7119 0.086225 -2.25155
H  3.958905 0.495805 -0.719138
H  3.0592 0.357333 1.916687
