program: Gaussian 09
title: 000139419
version: EM64L-G09RevD.01
frameworkgroup: C1[X(C6H10OSi)]
method: RPBEPBE
basis: SDD
operation: Freq
keyword: #p
keyword: freq=noraman
keyword: PBEPBE/SDD
title: #p freq=noraman PBEPBE/SDD
converged: YES YES NO NO
title: Mulliken charges:
elementType: Si O C C C C C C H H H H H H H H H H
charge: 1.012464 -0.231355 -0.108199 -1.005229 -1.005227 -0.360797 -0.268205 -0.183822 -0.084008 0.247347 0.236277 0.249390 0.236275 0.247345 0.249387 0.259099 0.251914 0.257345
chargesum: 0.00000
title: Mulliken charges with hydrogens summed into heavy atoms:
elementType: Si O C C C C C C
charge: 0.928456 -0.231355 -0.108199 -0.272216 -0.272220 -0.101698 -0.016291 0.073523
polarizability: 1.13154539e+02 -9.22208660e-04 6.78330452e+01 -4.01863192e-01 -1.28060296e-02 8.39473750e+01
1716.lowfreq: -7.9408 -0.0008 0.0014 0.0019 5.0711 11.1013 35.2037 91.1075 111.4437
frequency: 35.1245 91.0913 111.4419 131.5926 154.7873 191.7099 260.3228 292.4927 411.9578 591.5753 632.0244 641.3352 650.5696 708.2585 731.4609 733.3627 818.8540 831.0716 863.3979 870.7330 880.1669 905.7833 912.0466 920.9764 992.0857 1031.6131 1095.9617 1127.3624 1194.5714 1299.5763 1308.6795 1338.9723 1443.9414 1447.9337 1451.2280 1452.6612 1458.9946 1537.6456 2105.0827 2987.8206 2988.1512 3090.4780 3092.1932 3098.1483 3098.3710 3213.9768 3229.2645 3262.7950
redmass: 3.7367 3.4306 2.2303 1.0180 1.2101 2.5394 4.3207 3.6187 6.1665 3.0575 3.4438 3.2528 1.1745 3.2027 1.2155 1.2666 1.2798 1.4031 4.5931 6.0913 1.3654 1.2444 1.4101 1.3973 1.7245 3.6541 4.0086 1.5360 1.4946 1.1968 1.1901 2.2821 1.0519 1.0539 2.2573 1.5101 1.0486 5.1479 1.0406 1.0341 1.0340 1.0987 1.0982 1.0989 1.0986 1.0922 1.0973 1.1089
irintensity: 0.5701 0.8300 0.3242 0.0144 0.0148 0.9385 11.8279 4.6830 14.9394 5.4245 0.2130 3.1988 12.1921 12.8667 58.3460 84.3516 68.4275 3.0429 19.3119 0.9742 0.0519 86.3895 54.0591 178.9975 41.3199 6.7793 7.1590 16.1260 13.1048 37.8536 18.6605 4.6403 3.7022 1.1296 16.8467 1.8153 12.7151 3.1765 117.3098 13.7689 13.6946 0.6829 32.5535 9.5908 16.9969 3.4756 1.1297 1.2712
temp: 298.150 k
press: 1.00000 atm
elementType: 14 8 6 6 6 6 6 6 1 1 1 1 1 1 1 1 1 1
symmnumber: 1
zpe: 369165.5 jmol-1
zpe.correction: 0.140608 hartree
zpe.thermalcorrener: 0.150426 hartree
zpe.thermalcorrenthalpy: 0.151370 hartree
zpe.thermalcorrgfe: 0.104896 hartree
zpe.sumelectzpe: -598.616517 hartree
zpe.sumelectthermal: -598.606699 hartree
zpe.sumelectthermalent: -598.605755 hartree
zpe.sumelectthermalfe: -598.652229 hartree
dipole: -0.1549 -0.0001 0.2028
dipole: 0.2552
quadrupole: -49.0518 -58.7371 -54.9417
quadrupole: -0.0001 -0.0146 -0.0028
quadrupole: 5.1917 -4.4936 -0.6981 -0.0001 -0.0146 -0.0028
hfenergy: -598.7571248 hartree
pointgroup: C01 [X(C6H10O1Si1)]
dipole: 0.0630661 -0.0001132 -0.0781319 debye
dipolederiv: 1.6735111 -0.000004 -0.0098395 0.000035 1.2242329 -0.0003661 0.0441094 -0.0003686 0.9812999 -0.4704023 0.0001339 0.1213305 0.0003509 -0.1304661 -0.0006365 0.2061773 -0.00065 -0.5415716 -0.3169406 -0.0000623 -0.0379518 0.000048 -0.327706 0.0006229 -0.010545 0.0006897 0.0931405 -0.4068525 0.0327203 0.0210769 0.0193784 -0.3900834 -0.0442843 0.0299731 -0.039458 -0.2647122 -0.4068978 -0.0326671 0.0211564 -0.0192923 -0.3898587 0.044648 0.0300225 0.0398179 -0.2649487 -0.0525335 0.0002121 0.1122295 0.0000293 -0.1969372 0.0003087 -0.0089664 0.0003393 0.0151095 -0.0422638 0.0000209 -0.0069765 -0.0000065 -0.1975511 0.000115 -0.0019561 0.0000924 -0.1286794 0.1195795 -0.0001973 -0.1500073 -0.0002858 -0.1319926 0.000559 -0.2135442 0.0004433 0.1781263 -0.2966006 0.000022 0.0138117 -0.0000527 -0.2587248 -0.0000836 -0.0313068 -0.0000776 -0.3159224 0.1061957 -0.0552458 0.0270503 -0.0837858 -0.1017779 0.0748917 0.0137885 0.0584512 0.0767833 -0.1788734 0.0265155 -0.0235786 0.074434 0.1018336 0.0002288 0.0093299 -0.0053803 0.1082266 0.1147733 0.0002681 -0.0256995 -0.004065 0.0959874 -0.0323908 -0.0226922 -0.030175 -0.1121753 -0.1788978 -0.0265811 -0.0234916 -0.0744223 0.1018469 -0.0002108 0.009553 0.0054013 0.1082111 0.1062001 0.0553161 0.0268997 0.0838142 -0.1021501 -0.0743939 0.0135535 -0.057957 0.0771461 0.1147752 -0.0003364 -0.0257096 0.0040092 0.0961557 0.0318122 -0.02272 0.0295995 -0.1123493 0.1243709 -0.0000814 -0.0427737 -0.0000821 0.1800896 -0.0003128 -0.0274895 -0.000337 -0.0326338 -0.060634 0.0000295 0.0385221 0.0000333 0.2070204 -0.0001499 0.0386001 -0.0001317 0.1189042 0.0514904 -0.0000631 -0.0360489 -0.00014 0.2200815 -0.0003576 -0.0558873 -0.0002994 0.0160453 unknown
polarizability: 113.1551511|0.0034644|67.8330762|0.3789567|0.0256937|83.946732 unknown
InChI: InChI=1S/C6H10OSi/c1-8(2)6-4-3-5-7-6/h3-5,8H,1-2H3
charge 0 multiplicity 1
18 atoms
Si -1.67186 -0.00081 -0.534001
O  0.710577 0.001638 1.032858
C  0.209349 -0.00044 -0.305391
C  -2.438082 1.572726 0.230241
C  -2.438016 -1.572222 0.234672
C  1.297831 -0.001892 -1.17135
C  2.508907 -0.000341 -0.37525
C  2.112213 0.001432 0.950539
H  -1.87705 -0.00295 -2.032812
H  -2.013709 2.483375 -0.227828
H  -3.533295 1.588853 0.080977
H  -2.238151 1.611641 1.31624
H  -3.53324 -1.588749 0.085523
H  -2.01369 -2.48415 -0.220892
H  -2.238016 -1.608121 1.320762
H  1.239737 -0.003622 -2.258805
H  3.533372 -0.000739 -0.742523
H  2.640522 0.00287 1.900239
