program: Gaussian 09
title: 000139414
version: EM64L-G09RevD.01
frameworkgroup: C1[X(C17H24N2O)]
method: RPBEPBE
basis: SDD
operation: Freq
keyword: #p
keyword: freq=noraman
keyword: PBEPBE/SDD
title: #p freq=noraman PBEPBE/SDD
converged: YES YES NO NO
title: Mulliken charges:
elementType: O N N C C C C C C C C C C C C C C C C C H H H H H H H H H H H H H H H H H H H H H H H H
charge: -0.255158 -0.473830 -0.479053 0.129294 0.125909 0.194221 0.196703 0.135087 0.140542 0.161362 0.167423 -0.030278 -0.526504 -0.532304 -0.802863 -0.824268 -0.797957 -0.797507 -0.686027 -0.685790 0.323079 0.321679 0.196408 0.210813 0.218011 0.197415 0.236712 0.203820 0.265193 0.284998 0.229282 0.213083 0.240522 0.229243 0.244966 0.245445 0.230002 0.237382 0.230409 0.214611 0.215786 0.213976 0.216661 0.221503
chargesum: 0.00000
title: Mulliken charges with hydrogens summed into heavy atoms:
elementType: O N N C C C C C C C C C C C C C C C C C
charge: -0.255158 -0.150751 -0.157373 0.129294 0.125909 0.194221 0.196703 0.135087 0.140542 0.161362 0.167423 -0.030278 -0.119283 -0.116878 -0.097139 -0.096905 -0.083226 -0.084678 -0.025221 -0.033650
polarizability: 3.17640307e+02 -1.79744168e-01 2.14115203e+02 3.73997813e+00 -1.39724940e+00 1.35797740e+02
1716.lowfreq: -6.6287 -0.8728 -0.0004 0.0005 0.0008 6.3603 26.6846 33.1223 37.3641
frequency: 26.6287 33.0621 37.2935 43.4399 57.7908 60.7666 73.7320 75.5920 87.8969 98.5634 104.6187 138.8551 161.4294 171.6739 182.5951 194.2620 206.0715 207.0702 222.8445 273.5589 282.7976 285.7793 296.5394 316.0488 327.3409 357.6964 405.0830 419.6206 464.0216 487.7499 495.0366 548.2758 554.1353 581.2343 599.7515 642.6854 662.9450 680.2566 704.2577 708.7723 715.8492 738.5839 758.2970 761.1511 778.8220 808.7415 895.6387 965.0809 966.6462 971.8380 974.9481 989.6037 992.5962 1035.8750 1036.3702 1039.9524 1040.1882 1064.3230 1066.1415 1084.1872 1117.6795 1133.9489 1162.4233 1194.5030 1196.2914 1229.2010 1250.3408 1260.8155 1269.1855 1306.0123 1312.8860 1322.1884 1329.5967 1383.9642 1384.9083 1398.5099 1400.7446 1403.3299 1403.9529 1424.6714 1432.4697 1445.1843 1449.6904 1451.7358 1460.4803 1467.6627 1468.4191 1470.3530 1472.1100 1472.8623 1474.3003 1478.7264 1479.0753 1482.3549 1486.3510 1490.2658 1493.9121 1504.9128 1520.2325 1526.0797 1585.8732 1587.3603 2964.6571 2965.3422 2969.9273 2973.5511 2975.1587 2975.2771 2978.6349 2980.3501 3022.7348 3029.2877 3033.5546 3034.6850 3038.1757 3044.7908 3072.3566 3073.8426 3079.4749 3083.5597 3089.0764 3092.8083 3101.0072 3108.5969 3571.8229 3574.0823
redmass: 3.4384 2.9298 2.0554 2.2526 1.5954 2.1684 1.0746 1.1162 1.8750 2.4994 1.7538 3.6981 2.9457 2.7940 2.4693 2.0401 1.5564 1.6043 3.3768 2.6922 1.8135 2.1843 2.5702 4.2495 4.1080 6.9717 4.1334 4.2877 4.1564 2.5116 1.2302 3.9260 4.1449 3.8395 5.5055 4.7388 4.0529 4.5148 1.2015 3.5602 3.0470 2.9571 2.2175 3.5302 1.5492 2.0477 2.8288 2.2342 2.0241 1.7718 1.7345 1.4699 1.4607 1.4819 1.4692 1.4628 1.4781 2.0096 2.0094 1.9224 1.9299 2.7400 2.7586 3.5710 3.8165 1.9324 1.4388 1.2348 1.5842 2.2623 1.6312 2.1294 3.7292 1.2112 1.2117 1.2423 1.2848 1.2584 1.2574 2.9597 3.1772 1.3082 1.3820 1.9801 1.3874 1.1477 1.1165 1.0508 1.0972 1.0899 1.1077 1.1123 1.1386 1.1470 1.1520 1.4053 1.3976 3.4581 5.7390 6.7714 5.0633 5.0598 1.0396 1.0394 1.0394 1.0409 1.0547 1.0357 1.0391 1.0601 1.0998 1.0997 1.0979 1.0973 1.0970 1.0964 1.1000 1.1000 1.1009 1.1006 1.0955 1.0950 1.0971 1.0965 1.0802 1.0803
irintensity: 0.1652 0.3450 0.0896 0.2381 0.5371 0.3746 0.1108 0.1332 0.7596 0.4600 0.1410 0.3026 1.6243 4.8907 0.5283 2.8635 0.5135 0.1232 0.2767 5.4238 0.0553 0.4404 1.3843 16.3137 1.3399 2.4348 4.7626 2.6798 0.3924 36.9768 130.2551 2.6993 1.7404 4.6179 8.5534 6.5820 6.7475 0.4267 15.8177 4.0657 2.3991 27.9735 5.4058 5.9135 33.8443 4.0126 70.8739 18.6894 18.0723 0.5245 1.1526 1.0704 2.2362 15.5620 5.3118 2.3872 2.2607 18.8435 8.2999 11.4781 16.6061 1.8059 32.0374 1.9660 1.0709 7.6333 107.9933 9.3896 133.0347 45.4133 28.7963 41.5048 15.5255 12.8223 16.2177 37.7362 25.9044 8.2140 9.3763 18.9593 64.3938 38.3266 125.9447 20.3651 1.6219 9.1198 3.5702 20.9344 5.5382 23.3756 6.6914 1.5533 0.8065 1.6450 25.9266 0.4234 5.9118 131.5174 402.6550 22.9677 31.6002 44.2915 32.2394 76.6942 43.2563 42.6880 39.4816 43.8691 55.8075 42.8174 15.8285 9.3034 20.6493 21.7692 23.9743 24.0535 74.4367 59.3392 45.5782 43.1270 14.7890 14.2145 9.2784 2.2343 42.3767 50.3630
temp: 298.150 k
press: 1.00000 atm
elementType: 8 7 7 6 6 6 6 6 6 6 6 6 6 6 6 6 6 6 6 6 1 1 1 1 1 1 1 1 1 1 1 1 1 1 1 1 1 1 1 1 1 1 1 1
symmnumber: 1
zpe: 977235.0 jmol-1
zpe.correction: 0.372209 hartree
zpe.thermalcorrener: 0.395548 hartree
zpe.thermalcorrenthalpy: 0.396492 hartree
zpe.thermalcorrgfe: 0.317574 hartree
zpe.sumelectzpe: -845.460207 hartree
zpe.sumelectthermal: -845.436868 hartree
zpe.sumelectthermalent: -845.435924 hartree
zpe.sumelectthermalfe: -845.514842 hartree
dipole: 0.2929 5.9089 -0.0412
dipole: 5.9163
quadrupole: -108.0376 -121.6415 -120.6632
quadrupole: -0.4808 -0.5661 -0.9678
quadrupole: 8.7431 -4.8607 -3.8824 -0.4808 -0.5661 -0.9678
hfenergy: -845.8324161 hartree
pointgroup: C01 [X(C17H24N2O1)]
dipole: 0.0901469 -2.3245469 0.0799569 debye
polarizability: 317.4884319|-1.1432953|213.9873103|-6.3089491|-3.5265868|136.0775077 unknown
InChI: InChI=1S/C17H24N2O/c1-7-13-9(3)15(18-11(13)5)17(20)16-10(4)14(8-2)12(6)19-16/h18-19H,7-8H2,1-6H3
charge 0 multiplicity 1
44 atoms
O  -0.091145 2.537479 0.002342
N  -1.300347 -0.905731 -0.377117
N  1.401539 -0.730782 0.734752
C  -1.264774 0.445791 0.039444
C  1.263952 0.557135 0.162957
C  -3.427737 -0.34706 0.155955
C  3.482743 -0.072213 0.140034
C  -2.591379 0.80728 0.377022
C  2.56105 0.977664 -0.216755
C  -2.605762 -1.387147 -0.334143
C  2.741361 -1.109368 0.748209
C  -0.03266 1.253676 0.064057
C  -4.920893 -0.417006 0.381726
C  4.970339 -0.075093 -0.128939
C  -3.042715 2.14786 0.895341
C  2.917323 2.279425 -0.889065
C  -2.946683 -2.779118 -0.788461
C  3.188144 -2.416784 1.340247
C  -5.744616 0.218316 -0.771362
C  5.343045 -0.699071 -1.501804
H  -0.511625 -1.383919 -0.812745
H  0.653174 -1.205598 1.24017
H  -5.238192 -1.469518 0.514296
H  -5.177486 0.100977 1.327111
H  5.348531 0.964478 -0.094414
H  5.503939 -0.624271 0.671822
H  -3.429317 2.782366 0.074497
H  -3.853908 2.038189 1.639309
H  -2.203149 2.701967 1.344256
H  2.010357 2.867129 -1.097385
H  3.565931 2.89633 -0.236922
H  3.471253 2.11185 -1.832579
H  -2.789312 -2.911057 -1.877175
H  -2.341961 -3.548422 -0.270233
H  -4.007374 -2.998106 -0.583729
H  4.283456 -2.423269 1.467223
H  2.737766 -2.595842 2.335625
H  2.926956 -3.280724 0.697549
H  -5.475704 1.281133 -0.90666
H  -6.829244 0.161982 -0.562497
H  -5.548855 -0.30011 -1.727618
H  5.021925 -1.755667 -1.554721
H  6.434968 -0.661806 -1.673516
H  4.846185 -0.157143 -2.326803
