program: Gaussian 09
title: 000139369
version: EM64L-G09RevD.01
frameworkgroup: C1[X(C14H13NO2)]
method: RPBEPBE
basis: SDD
operation: Freq
keyword: #p
keyword: freq=noraman
keyword: PBEPBE/SDD
title: #p freq=noraman PBEPBE/SDD
converged: YES YES NO NO
title: Mulliken charges:
elementType: O O N C C C C C C C C C C C C C C H H H H H H H H H H H H H
charge: -0.277218 -0.263817 -0.477565 0.530121 0.250061 -0.601620 0.132319 -0.376826 0.380986 -0.385991 -0.198798 -0.342581 -0.355438 -0.222676 -0.237484 -0.226605 -0.535996 0.313503 0.243311 0.309912 0.241858 0.223393 0.274756 0.217078 0.233473 0.230764 0.233601 0.221651 0.221964 0.243866
chargesum: 0.00000
title: Mulliken charges with hydrogens summed into heavy atoms:
elementType: O O N C C C C C C C C C C C C C C
charge: -0.277218 -0.263817 -0.164062 0.530121 0.250061 -0.358310 0.132319 -0.066914 0.380986 -0.144134 0.024594 -0.067825 -0.138359 0.010797 -0.006720 0.006996 0.151484
polarizability: 2.86879700e+02 -1.51475005e+00 1.67619434e+02 6.03619519e+00 4.57350651e+00 7.44994927e+01
1716.lowfreq: -5.2324 -5.0334 0.0001 0.0006 0.0007 5.5947 27.5498 41.8629 58.8886
frequency: 27.4410 41.7436 58.8752 76.2582 102.1933 158.5810 185.4524 204.1876 225.1143 257.3847 266.0344 284.0332 319.2745 401.9066 413.9128 452.5630 456.4576 480.2107 542.2397 582.5272 597.9965 614.7695 652.2282 671.3383 686.4211 691.0481 703.5361 734.6967 783.4247 790.7105 852.6739 864.1403 865.8731 890.7877 892.3466 934.4337 979.8276 983.4690 984.7668 989.2913 1005.7970 1012.7104 1027.4037 1082.1765 1091.5120 1096.8615 1112.0404 1152.5598 1165.0381 1173.9779 1191.2621 1195.9059 1244.5763 1272.6087 1307.8254 1319.9299 1384.5451 1389.3747 1412.0920 1434.0159 1437.8766 1466.9662 1473.7790 1479.4683 1481.5425 1522.8541 1576.2568 1596.1670 1609.2841 1610.3235 1624.9351 2960.6534 3048.4083 3114.2428 3124.5205 3132.3194 3135.8246 3138.8021 3145.4798 3158.5377 3170.2551 3170.5157 3205.4257 3533.7226
redmass: 3.9349 4.6260 5.0715 4.7528 4.2476 4.7142 4.1340 1.7675 6.3979 3.6268 1.8570 3.9375 6.5671 2.8196 4.7947 4.6490 3.3450 4.6614 4.9350 5.7251 2.6865 6.3840 1.5864 5.7512 4.5699 2.0556 1.5267 6.4729 1.3745 2.3448 1.3866 4.2377 1.7655 4.7145 1.4497 1.4567 5.6602 1.4426 1.3251 5.0958 1.3439 4.6044 2.2970 1.7149 1.5970 2.3098 1.2593 1.4300 1.3964 1.0585 1.1200 1.4388 2.9249 2.2384 1.6061 1.4359 8.8076 5.8007 2.9642 1.8837 1.3362 1.0502 1.0794 2.1565 2.7972 2.2779 6.2508 5.4592 5.2945 5.8481 6.4913 1.0328 1.1040 1.0878 1.0995 1.0868 1.0915 1.0886 1.0918 1.0957 1.1003 1.0946 1.0951 1.0758
irintensity: 0.0278 2.6803 0.8909 0.4126 13.0223 2.2082 3.5781 0.2882 1.2258 1.7143 1.3765 2.7687 6.9458 0.1906 2.1193 2.0477 5.9036 5.0906 5.1863 21.7598 16.4819 1.0488 23.8624 15.5382 19.0607 22.8602 107.6372 7.0605 56.4082 10.5563 1.7644 14.2414 56.7930 10.0111 11.5398 3.1985 0.6447 1.8945 4.8738 0.9878 2.2807 30.4772 28.2773 24.0894 18.9658 1.3092 0.2488 21.4675 101.4296 1.5585 5.8330 65.1041 127.5573 79.7997 40.0382 9.0278 1.1279 235.0434 93.0767 18.1104 6.1868 13.0692 17.1807 4.2967 251.1450 169.3026 91.0116 90.1995 68.3082 10.7139 195.9134 73.6288 49.2873 13.9510 26.4757 1.2055 9.6927 8.7154 20.9978 16.3151 29.9181 6.5512 9.8240 9.4695
temp: 298.150 k
press: 1.00000 atm
elementType: 8 8 7 6 6 6 6 6 6 6 6 6 6 6 6 6 6 1 1 1 1 1 1 1 1 1 1 1 1 1
symmnumber: 1
zpe: 620207.2 jmol-1
zpe.correction: 0.236224 hartree
zpe.thermalcorrener: 0.251022 hartree
zpe.thermalcorrenthalpy: 0.251966 hartree
zpe.thermalcorrgfe: 0.192887 hartree
zpe.sumelectzpe: -745.290792 hartree
zpe.sumelectthermal: -745.275995 hartree
zpe.sumelectthermalent: -745.275050 hartree
zpe.sumelectthermalfe: -745.334130 hartree
dipole: -0.9891 -3.0226 0.2404
dipole: 3.1894
quadrupole: -64.7728 -98.0344 -104.7066
quadrupole: -6.8478 2.1151 2.2529
quadrupole: 24.3985 -8.8631 -15.5353 -6.8478 2.1151 2.2529
hfenergy: -745.5270167 hartree
pointgroup: C01 [X(C14H13N1O2)]
dipole: 0.3884041 -1.1906631 -0.0777197 debye
polarizability: 286.8522572|1.5151281|167.4778956|6.5170242|-5.8192396|74.6684738 unknown
InChI: InChI=1S/C14H13NO2/c1-17-13-9-5-8-12(10-13)15-14(16)11-6-3-2-4-7-11/h2-10,15H,1H3
charge 0 multiplicity 1
30 atoms
O  4.369929 -1.609451 -0.179364
O  -1.195045 2.072916 0.074885
N  -0.149958 -0.029282 -0.045875
C  1.229476 0.320471 0.002576
C  -2.598659 0.094182 0.002462
C  2.161756 -0.73997 -0.105847
C  -1.267153 0.806025 0.021198
C  1.687908 1.65946 0.155348
C  3.548492 -0.475115 -0.061718
C  4.022556 0.85121 0.092628
C  3.075524 1.896012 0.198467
C  -3.726706 0.844629 -0.418213
C  -2.779134 -1.253338 0.414755
C  -5.006174 0.253906 -0.454228
C  -4.062078 -1.843066 0.382955
C  -5.177276 -1.094166 -0.058519
C  5.818555 -1.397619 -0.14222
H  -0.338839 -1.023572 -0.18872
H  1.836574 -1.780288 -0.224169
H  0.965155 2.472197 0.229205
H  5.092076 1.075402 0.129385
H  3.432222 2.925395 0.316144
H  -3.572295 1.890286 -0.7034
H  -1.94031 -1.842059 0.807348
H  -5.868888 0.84119 -0.786956
H  -4.193296 -2.87932 0.713094
H  -6.171619 -1.55355 -0.083094
H  6.136201 -0.952404 0.820708
H  6.153025 -0.752043 -0.977516
H  6.257984 -2.400238 -0.249817
