program: Gaussian 09
title: 000139366
version: EM64L-G09RevD.01
frameworkgroup: C1[X(C3H4)]
method: RPBEPBE
basis: SDD
operation: Freq
keyword: #p
keyword: freq=noraman
keyword: PBEPBE/SDD
title: #p freq=noraman PBEPBE/SDD
converged: NO YES NO NO
title: Mulliken charges:
elementType: C C C H H H H
charge: -0.743079 0.192387 -0.463119 0.247818 0.247842 0.247816 0.270333
chargesum: 0.00000
title: Mulliken charges with hydrogens summed into heavy atoms:
elementType: C C C
charge: 0.000398 0.192387 -0.192785
polarizability: 4.66361595e+01 -1.07256500e-02 1.85701890e+01 -9.08230474e-03 -1.32453375e-03 1.85708735e+01
1716.lowfreq: -21.7634 -0.0007 -0.0002 0.0003 12.4149 15.5921 334.4482 334.7394 639.3906
frequency: 334.4442 334.7351 639.3875 639.4053 935.6995 1035.4505 1035.5749 1404.2328 1464.6666 1464.8120 2148.0755 2981.4803 3072.8809 3073.0779 3427.9547
redmass: 3.1961 3.1972 1.2299 1.2297 4.2898 1.3970 1.3970 1.2142 1.0409 1.0409 6.0264 1.0350 1.0985 1.0986 1.1587
irintensity: 8.6024 8.6015 78.1939 78.0750 0.8383 4.3832 4.3850 5.9014 16.9272 16.9096 8.5109 21.9962 14.9334 14.9323 56.2376
temp: 298.150 k
press: 1.00000 atm
elementType: 6 6 6 1 1 1 1
symmnumber: 1
zpe: 143503.3 jmol-1
zpe.correction: 0.054658 hartree
zpe.thermalcorrener: 0.058657 hartree
zpe.thermalcorrenthalpy: 0.059601 hartree
zpe.thermalcorrgfe: 0.030386 hartree
zpe.sumelectzpe: -116.419967 hartree
zpe.sumelectthermal: -116.415968 hartree
zpe.sumelectthermalent: -116.415023 hartree
zpe.sumelectthermalfe: -116.444238 hartree
dipole: -0.9600 0.0074 0.0046
dipole: 0.9600
quadrupole: -13.3312 -19.4803 -19.4806
quadrupole: 0.0173 0.0107 -0.0001
quadrupole: 4.0995 -2.0496 -2.0499 0.0173 0.0107 -0.0001
hfenergy: -116.4746244 hartree
pointgroup: C01 [X(C3H4)]
dipole: -0.3776828 -0.0029327 0.0020555 debye
dipolederiv: -0.0034209 -0.0001042 0.000048 -0.0002667 0.0795652 -0.0001989 0.0002672 -0.0001921 0.0793982 0.3046991 0.0009025 -0.0005835 0.0014289 -0.0854251 0.0001754 -0.0009867 0.0001696 -0.0852757 -0.526851 -0.0011532 0.0008099 -0.0024079 -0.3537634 -0.0001456 0.0016476 -0.0001462 -0.3538768 0.0117194 0.0037741 0.0598519 0.0061424 0.1395601 -0.0140024 0.0976708 -0.0140412 -0.0783961 0.0115379 0.0499636 -0.0333131 0.0817128 -0.0114988 0.101375 -0.0544608 0.1013785 0.0729749 0.0117709 -0.0538258 -0.0265117 -0.0879193 -0.0361889 -0.0872705 -0.0432474 -0.0872359 0.0973672 0.1905445 0.000443 -0.0003014 0.00131 0.267751 0.0000671 -0.0008909 0.0000672 0.2678084 unknown
polarizability: 46.6361423|0.0225618|18.5698233|-0.0130866|0.0011553|18.5712564 unknown
InChI: InChI=1S/C3H4/c1-3-2/h1H,2H3
charge 0 multiplicity 1
7 atoms
C  -1.386972 0.000157 -0.000088
C  0.084319 0.00143 -0.001043
C  1.318168 0.002075 -0.001404
H  -1.782111 0.066198 1.029687
H  -1.783931 0.858158 -0.572104
H  -1.782368 -0.924938 -0.457054
H  2.392695 -0.00228 0.001606
