program: Gaussian 09
title: 000139145
version: EM64L-G09RevD.01
frameworkgroup: C1[X(C12H10O4S2)]
method: RPBEPBE
basis: SDD
operation: Freq
keyword: #p
keyword: freq=noraman
keyword: PBEPBE/SDD
title: #p freq=noraman PBEPBE/SDD
converged: YES YES NO NO
title: Mulliken charges:
elementType: S S O O O O C C C C C C C C C C C C H H H H H H H H H H
charge: 0.844086 0.843502 -0.502591 -0.496104 -0.496473 -0.501908 -0.112033 -0.111721 -0.231071 -0.231361 -0.203367 -0.203224 -0.196456 -0.196450 -0.200471 -0.200573 -0.211420 -0.211428 0.289425 0.289706 0.287118 0.287180 0.245675 0.245699 0.245879 0.245927 0.241221 0.241232
chargesum: 0.00000
title: Mulliken charges with hydrogens summed into heavy atoms:
elementType: S S O O O O C C C C C C C C C C C C
charge: 0.844086 0.843502 -0.502591 -0.496104 -0.496473 -0.501908 -0.112033 -0.111721 0.058355 0.058345 0.083750 0.083956 0.049219 0.049250 0.045408 0.045354 0.029801 0.029804
polarizability: 3.33507784e+02 -8.82010312e-01 1.52540532e+02 -1.20248300e-01 -1.96456778e+00 1.83515357e+02
1716.lowfreq: -10.3793 -8.2965 -0.0015 0.0006 0.0014 1.8410 6.6320 16.3458 20.9001
frequency: -6.6806 14.6225 20.1906 35.1355 45.1388 74.4916 112.6835 129.0986 138.4688 141.7836 147.4578 162.7345 239.6576 239.6824 315.4812 319.3915 332.0281 369.3734 383.7842 401.1760 401.3568 408.5783 478.2841 494.2113 598.6743 598.8345 649.6253 650.7738 684.0063 684.3247 755.3529 755.9925 771.9588 783.7925 839.9597 840.6119 894.2854 896.5174 931.2400 931.6850 970.6247 971.9516 982.1586 982.4211 1004.3361 1004.4899 1005.7393 1005.8572 1040.4442 1041.0892 1078.4968 1078.9095 1174.2988 1174.4846 1180.3827 1181.9966 1305.8116 1306.1407 1383.0802 1383.3009 1435.8279 1436.0227 1448.6324 1449.0683 1569.8735 1570.4733 1596.7634 1596.9599 3141.3713 3141.4334 3152.8968 3153.2165 3162.6144 3162.7512 3172.3220 3172.4700 3180.7000 3180.9171
redmass: 5.5712 5.4608 6.5823 4.5962 7.7987 10.9373 12.9200 10.5116 6.6524 7.9719 7.6254 5.7634 8.9217 8.9243 9.8029 7.1475 8.0876 10.9540 15.0230 2.8140 2.8097 10.1021 3.7472 4.4820 6.4904 6.4900 7.0064 7.0255 2.3510 2.3764 1.4429 1.4260 14.4368 16.5414 1.2558 1.2475 17.5240 18.9020 1.3455 1.3440 6.4177 6.4216 1.3949 1.3939 4.6226 4.4668 1.3631 1.3833 2.0101 2.0099 1.5496 1.5508 1.0564 1.0561 1.1191 1.1216 1.2921 1.2913 8.5823 8.6528 2.2479 2.2490 1.9899 1.9899 5.7734 5.7504 6.8224 6.8188 1.0861 1.0861 1.0890 1.0890 1.0934 1.0933 1.0974 1.0974 1.1005 1.1004
irintensity: 1.4593 3.0562 3.5981 0.0372 0.0380 1.6857 0.0067 0.1902 8.1745 2.1183 9.1218 0.0074 15.0989 13.6876 129.1725 1.0997 33.2339 0.0733 110.4144 0.2534 0.0780 0.7890 132.7216 4.0369 0.0988 0.0672 1.0492 0.1169 35.3663 8.3957 73.8991 13.6969 150.9637 0.4028 0.6421 0.1298 13.4752 58.9100 0.9447 0.8244 19.9718 0.3089 0.1908 0.1136 0.4421 0.0212 3.1679 0.0326 40.5012 6.5630 2.6083 13.1552 1.2741 0.4317 32.9150 0.0598 1.4270 6.9773 6.4885 8.2907 17.6332 15.5872 24.7486 4.6294 6.2221 0.4078 0.2873 1.4016 1.4431 1.1846 8.3330 11.3880 2.2380 2.4515 15.7168 0.9333 42.9354 3.6091
temp: 298.150 k
press: 1.00000 atm
elementType: 16 16 8 8 8 8 6 6 6 6 6 6 6 6 6 6 6 6 1 1 1 1 1 1 1 1 1 1
symmnumber: 1
zpe: 500354.7 jmol-1
zpe.correction: 0.190575 hartree
zpe.thermalcorrener: 0.208026 hartree
zpe.thermalcorrenthalpy: 0.208970 hartree
zpe.thermalcorrgfe: 0.141751 hartree
zpe.sumelectzpe: -1558.704805 hartree
zpe.sumelectthermal: -1558.687354 hartree
zpe.sumelectthermalent: -1558.686410 hartree
zpe.sumelectthermalfe: -1558.753628 hartree
dipole: 0.0133 -0.0472 1.0854
dipole: 1.0865
quadrupole: -70.2433 -139.2591 -116.4039
quadrupole: -8.8999 -0.5128 -1.3576
quadrupole: 38.3922 -30.6236 -7.7685 -8.8999 -0.5128 -1.3576
hfenergy: -1558.8953797 hartree
pointgroup: C01 [X(C12H10O4S2)]
dipole: 0.003084 0.42742 -0.0050101 debye
polarizability: 333.439583|0.7068675|183.6408957|3.5393737|0.2586585|152.4831949 unknown
InChI: InChI=1S/2C6H5O2S/c2*7-9(8)6-4-2-1-3-5-6/h2*1-5H
charge 0 multiplicity 1
28 atoms
S  -0.800558 0.135294 1.159567
S  0.793215 0.143424 -1.153071
O  -0.330047 1.555804 1.844599
O  -0.806974 -1.268227 2.013126
O  0.811567 -1.262333 -2.002215
O  0.306113 1.556932 -1.841377
C  -2.517215 0.377535 0.413265
C  2.509063 0.404109 -0.411016
C  -3.363273 -0.742348 0.344752
C  3.37145 -0.704023 -0.355113
C  -2.852502 1.658596 -0.058659
C  2.828146 1.686185 0.069744
C  -4.645531 -0.550746 -0.218891
C  4.65323 -0.498738 0.204718
C  -4.139953 1.822396 -0.620103
C  4.115203 1.863375 0.627953
C  -5.028325 0.724033 -0.700158
C  5.019573 0.777231 0.69539
H  -3.040235 -1.713486 0.732821
H  3.060059 -1.676828 -0.74853
H  -2.147229 2.490982 0.017636
H  2.111601 2.50962 0.003013
H  -5.338746 -1.395727 -0.280867
H  5.358697 -1.334202 0.256823
H  -4.440525 2.804425 -0.998865
H  4.403118 2.846446 1.013743
H  -6.021813 0.861188 -1.140256
H  6.012792 0.924882 1.132675
