program: Gaussian 09
title: 000139142
version: EM64L-G09RevD.01
frameworkgroup: C1[X(C8H14O)]
method: RPBEPBE
basis: SDD
operation: Freq
keyword: #pfreq=noraman
keyword: PBEPBE/SDD
title: #p freq=noraman PBEPBE/SDD
converged: YES YES NO NO
title: Mulliken charges:
elementType: O C C C C C C C C H H H H H H H H H H H H H H
charge: -0.289563 -0.194926 -0.121826 -0.492364 -0.044025 -0.521048 -0.447694 -0.464391 -0.519601 0.236939 0.229968 0.220647 0.218394 0.216364 0.231288 0.228105 0.226412 0.218204 0.220985 0.208321 0.231167 0.199589 0.209055
chargesum: 0.00000
title: Mulliken charges with hydrogens summed into heavy atoms:
elementType: O C C C C C C C C
charge: -0.289563 0.042014 0.108142 -0.053323 0.172339 -0.061655 -0.003078 -0.035085 0.120210
polarizability: 9.20589345e+01 1.92035153e+00 7.94095379e+01 4.18061714e-01 -7.98647471e-01 7.61217366e+01
1716.lowfreq: -25.1894 -0.0008 -0.0003 0.0004 7.0244 28.5423 86.9876 118.9611 198.5660
frequency: 86.8297 118.9105 198.5388 241.2228 262.1172 371.8997 395.5626 426.0264 504.4714 552.5466 728.2013 751.6753 796.0952 803.2396 830.0882 880.6451 917.8034 926.1498 943.2230 947.6366 965.0155 976.2655 1014.0210 1052.9127 1054.6356 1080.0636 1110.2945 1117.0270 1118.4187 1134.9641 1162.1012 1178.2935 1200.8339 1237.7605 1248.7639 1261.1299 1274.6621 1292.1358 1297.6406 1306.9082 1324.9874 1340.7593 1434.2355 1455.5322 1457.5517 1460.7912 1464.5967 1478.8383 1486.2192 2920.8512 2926.3949 2994.8958 2997.9563 2999.6210 3011.0582 3012.5253 3052.5333 3055.9358 3065.6489 3067.5658 3078.0140 3082.7058 3097.8073
redmass: 2.8875 2.2983 1.1789 2.5827 2.1696 1.9699 2.8931 1.8476 3.7115 3.8596 3.5628 2.5199 3.0702 1.5549 2.4201 2.6124 2.9299 2.6077 1.7444 1.8388 1.8548 1.8007 2.4189 1.5705 3.4606 1.6591 1.1345 1.2075 1.1918 1.3749 1.8198 1.5943 1.3671 1.3763 1.6348 1.3906 1.4501 1.4560 1.5144 1.5380 1.4699 1.3511 1.1378 1.0674 1.0716 1.0868 1.0930 1.0527 1.0972 1.0720 1.0465 1.0599 1.0631 1.0975 1.0616 1.0626 1.0927 1.0977 1.0968 1.1004 1.1039 1.1038 1.0974
irintensity: 0.7622 5.2355 0.0431 3.2808 7.7361 0.9849 0.9999 0.1320 4.7952 0.3392 1.1732 4.0017 4.3112 3.2232 7.2213 1.1955 0.4039 2.8126 7.3590 8.3723 1.2698 4.7419 10.8775 4.2312 69.9072 21.1322 0.3901 4.9771 3.7888 0.2094 15.3640 3.3775 4.8757 4.7759 0.1200 1.9262 0.8442 2.0103 2.2082 2.8463 1.7533 24.8141 3.5629 4.9213 8.4237 12.1741 12.5129 9.1861 4.6985 37.6990 103.3389 38.9811 41.9378 67.9000 30.0046 72.4414 74.0495 33.1302 12.1661 24.7416 31.8530 65.3641 34.0282
temp: 298.150 k
press: 1.00000 atm
elementType: 8 6 6 6 6 6 6 6 6 1 1 1 1 1 1 1 1 1 1 1 1 1 1
symmnumber: 1
zpe: 538521.4 jmol-1
zpe.correction: 0.205112 hartree
zpe.thermalcorrener: 0.213450 hartree
zpe.thermalcorrenthalpy: 0.214394 hartree
zpe.thermalcorrgfe: 0.172304 hartree
zpe.sumelectzpe: -387.720491 hartree
zpe.sumelectthermal: -387.712154 hartree
zpe.sumelectthermalent: -387.711210 hartree
zpe.sumelectthermalfe: -387.753300 hartree
dipole: 0.0050 0.3680 1.4956
dipole: 1.5402
quadrupole: -52.8750 -55.5648 -56.8551
quadrupole: 1.7316 2.5560 -0.7098
quadrupole: 2.2233 -0.4665 -1.7568 1.7316 2.5560 -0.7098
hfenergy: -387.9256035 hartree
pointgroup: C01 [X(C8H14O1)]
dipole: -0.004116 -0.1736006 -0.5805545 debye
dipolederiv: -1.0476542 0.1110966 -0.0275078 0.1402059 -0.4967649 -0.0028867 -0.1318638 0.0150646 -0.3973616 -0.078343 -0.0236986 -0.0706229 -0.0605783 -0.0120637 0.0168838 -0.0877652 0.0271821 0.0461951 0.1438754 -0.037229 -0.0112563 -0.0264792 0.0879461 -0.0096617 -0.0301536 0.0007254 0.0599579 0.0116054 0.0722881 0.0199071 0.0178864 0.0806533 -0.0408093 0.0100809 -0.0251135 0.0025928 0.7225695 -0.0190024 0.067099 0.0558005 0.335103 -0.0780806 0.289937 -0.146788 0.3544307 -0.069836 0.012555 0.0400048 0.0094904 0.0626087 -0.0420719 0.0424785 -0.0679869 0.0163917 0.0211483 0.020979 0.0539992 0.0192745 0.0684584 0.0546003 0.0367944 0.0392533 0.0126648 0.1071786 0.0474181 0.0172076 0.0599422 -0.0133972 0.018359 0.0193927 0.0318812 0.0738738 0.5929507 -0.0623166 -0.0643261 -0.1161439 0.3749747 -0.0039422 -0.2263636 0.0343952 0.2663556 -0.0098826 0.061909 0.1117461 0.050749 -0.0174688 -0.0835775 0.1098772 -0.0793345 -0.0770795 -0.1445797 0.1206761 0.043481 0.1174378 -0.0313485 -0.0223448 0.0443583 -0.0191355 0.0568831 -0.0921084 -0.0968046 -0.0865942 -0.1316489 -0.0359489 -0.0888486 -0.0525137 -0.045234 0.0371893 0.0736312 -0.022427 0.0364415 0.0152853 -0.0706377 0.1632053 0.0009705 0.1194855 -0.0789968 -0.093939 -0.0556149 0.0834148 -0.0485683 -0.057155 0.1012785 0.0283525 0.1329311 -0.1412891 0.0316154 0.0141479 0.0153002 0.0116238 -0.1765177 0.0477224 0.0005149 0.1111654 0.048414 0.0562643 -0.0158197 -0.0569184 -0.0171292 0.0811717 0.0051049 -0.0524491 -0.0545341 -0.1150519 -0.0372288 0.1028894 -0.0871524 0.0739708 0.0625398 0.0099876 -0.0945126 0.050103 -0.0105141 0.014028 -0.0895819 -0.0116816 -0.0592657 -0.1608754 -0.0548151 -0.0019189 -0.0887541 0.0426206 -0.1599513 -0.1061361 0.0547503 -0.118527 -0.0176246 0.0171705 -0.0046035 -0.0087178 0.064902 0.059537 -0.0000059 -0.0691331 0.0117441 0.0520056 -0.0546596 -0.0057089 -0.0237871 -0.1777038 -0.0961062 0.0410995 -0.0962752 0.0416824 0.0948794 0.0068854 -0.1446472 0.0174279 -0.0092826 -0.0203962 -0.001023 0.0551896 -0.0568396 -0.0302522 0.1238873 0.1961214 0.0865313 -0.1043589 0.0156217 -0.0753991 -0.0170731 0.0100872 -0.1802859 -0.0833868 0.0536216 -0.1067606 0.0291668 unknown
polarizability: 91.9954381|-2.1278935|79.3817656|-0.4335525|-0.9387028|76.2130053 unknown
InChI: InChI=1S/C8H14O/c1-9-8-5-6-2-3-7(8)4-6/h6-8H,2-5H2,1H3
charge 0 multiplicity 1
23 atoms
O  1.816905 0.297404 0.573109
C  -0.080995 -0.60101 -0.898337
C  -1.66544 0.635919 0.19197
C  -1.432275 0.08973 -1.249289
C  0.724505 0.62454 -0.351355
C  -0.355939 1.447811 0.424094
C  -0.480678 -1.508585 0.302929
C  -1.591707 -0.669581 1.037671
C  2.929572 -0.385518 -0.083734
H  0.417271 -1.135022 -1.72481
H  -2.587909 1.219416 0.347064
H  -2.20562 -0.626552 -1.580581
H  -1.334622 0.889043 -2.007882
H  1.144758 1.20061 -1.207353
H  -0.439633 2.475739 0.028936
H  -0.077961 1.510919 1.490613
H  0.384233 -1.707236 0.95866
H  -0.873035 -2.477278 -0.056367
H  -2.563191 -1.197588 1.033955
H  -1.327288 -0.459272 2.089242
H  3.719321 -0.490379 0.677287
H  3.318811 0.207227 -0.940175
H  2.639917 -1.391636 -0.452847
