program: Gaussian 09
title: 000139134
version: EM64L-G09RevD.01
frameworkgroup: C1[X(C5H3N3)]
method: RPBEPBE
basis: SDD
operation: Freq
keyword: #p
keyword: freq=noraman
keyword: PBEPBE/SDD
title: #p freq=noraman PBEPBE/SDD
converged: NO YES NO NO
title: Mulliken charges:
elementType: N N N C C C C C H H H
charge: 0.052066 0.052233 0.052296 0.214721 -0.653715 -0.161856 -0.162265 -0.162278 0.256267 0.256286 0.256244
chargesum: 0.00000
title: Mulliken charges with hydrogens summed into heavy atoms:
elementType: N N N C C C C C
charge: 0.052066 0.052233 0.052296 0.214721 0.115083 -0.161856 -0.162265 -0.162278
polarizability: 6.59240977e+01 8.04723834e-04 6.58231713e+01 -7.78192536e-03 -1.68793348e-02 4.88632284e+01
1716.lowfreq: -10.4996 -6.7244 -0.0002 0.0007 0.0008 2.5035 121.9729 122.0016 151.7928
frequency: 121.9728 122.0014 151.7922 214.7744 215.1075 227.3765 362.0368 474.8989 475.1706 556.9783 560.4032 560.7219 632.7033 923.6139 923.8375 1013.0359 1161.5952 1161.7481 1391.3287 1466.3841 1466.7900 2209.4016 2209.4377 2212.5962 3018.8857 3136.3967 3136.5698
redmass: 10.7452 10.7412 9.7973 4.1754 4.1849 1.0437 9.8222 6.6218 6.6203 12.7621 12.1658 12.1675 6.0168 2.1147 2.1174 10.3178 2.5670 2.5643 1.1559 1.0475 1.0473 12.6633 12.6632 12.6454 1.0328 1.1036 1.1035
irintensity: 3.6899 3.6833 11.7655 0.0352 0.0369 0.0001 0.0001 0.1060 0.0976 0.4900 1.0855 1.1129 8.6029 1.6073 1.6097 3.0586 36.9719 36.9747 7.0873 10.8872 10.8516 0.7176 0.7037 0.0584 2.8730 5.2203 5.2441
temp: 298.150 k
press: 1.00000 atm
elementType: 7 7 7 6 6 6 6 6 1 1 1
symmnumber: 1
zpe: 180083.2 jmol-1
zpe.correction: 0.068590 hartree
zpe.thermalcorrener: 0.076765 hartree
zpe.thermalcorrenthalpy: 0.077710 hartree
zpe.thermalcorrgfe: 0.035938 hartree
zpe.sumelectzpe: -355.947714 hartree
zpe.sumelectthermal: -355.939539 hartree
zpe.sumelectthermalent: -355.938595 hartree
zpe.sumelectthermalfe: -355.980367 hartree
dipole: -0.0013 -0.0075 3.7929
dipole: 3.7929
quadrupole: -56.2060 -56.1743 -42.3445
quadrupole: 0.0010 -0.0051 -0.0121
quadrupole: -4.6311 -4.5994 9.2304 0.0010 -0.0051 -0.0121
hfenergy: -356.0163045 hartree
pointgroup: C01 [X(C5H3N3)]
dipole: -0.0010438 0.0006249 -1.4922525 debye
dipolederiv: -0.1470773 0.0058373 -0.0020314 0.0053879 -0.0620694 -0.0289951 -0.0031787 -0.0464033 -0.1460982 -0.0902564 -0.0394909 -0.0254167 -0.0393177 -0.1204833 0.0174165 -0.038636 0.0265071 -0.1449274 -0.0781628 0.0325779 0.0280832 0.0329882 -0.1319699 0.0134347 0.0425494 0.0202254 -0.1446453 0.5696044 0.0001539 0.0001452 0.0001261 0.5700116 -0.0001323 0.0001609 0.0005485 0.3331574 -0.0560341 0.0000903 0.0001038 -0.0000436 -0.056454 0.0002318 -0.0001031 -0.00007 0.1716352 -0.1552602 0.0084173 -0.0038021 0.0084086 -0.0537961 -0.0469449 0.000463 0.0095192 -0.0784991 -0.0841583 -0.0485905 -0.0376661 -0.0484017 -0.1227396 0.0254801 0.0086157 -0.0059296 -0.080017 -0.0718122 0.0410645 0.040704 0.0408494 -0.1358138 0.0196716 -0.0099901 -0.0045577 -0.0803758 -0.0172337 -0.0690745 -0.0429613 -0.0691154 0.092665 -0.0207024 -0.0422808 -0.0204071 0.0566103 0.005354 0.0820796 0.0393331 0.082165 0.070093 -0.0268192 0.0388711 -0.0264333 0.0565705 0.1250366 -0.0130649 0.0035082 -0.0130466 -0.0494435 0.0473589 0.0035284 0.0470007 0.0565895 unknown
polarizability: 65.8534531|-0.0463222|65.893679|0.0224848|0.0465426|48.8633653 unknown
InChI: InChI=1S/C5H3N3/c1-5(2-6,3-7)4-8/h1H3
charge 0 multiplicity 1
11 atoms
N  -0.187697 -2.532771 0.550484
N  -2.096937 1.431827 0.555187
N  2.287698 1.099815 0.555673
C  -0.000345 0.000396 -0.310766
C  -0.000501 0.000069 -1.885486
C  -0.105783 -1.400614 0.190656
C  -1.161166 0.792272 0.190103
C  1.265745 0.610139 0.189874
H  -0.935917 -0.451304 -2.251352
H  0.857953 -0.584453 -2.251603
H  0.076451 1.035726 -2.25167
