program: Gaussian 09
title: 000139132
version: EM64L-G09RevD.01
frameworkgroup: C1[X(C8H7N3O)]
method: RPBEPBE
basis: SDD
operation: Freq
keyword: #pfreq=noraman
keyword: PBEPBE/SDD
title: #p freq=noraman PBEPBE/SDD
converged: NO YES NO YES
title: Mulliken charges:
elementType: O N N N C C C C C C C C H H H H H H H
charge: -0.155272 -0.016644 -0.069743 -0.623485 0.329203 -0.050483 -0.366149 -0.366153 0.082812 -0.209637 -0.209640 -0.231581 0.254171 0.254169 0.235151 0.235148 0.235904 0.333058 0.339172
chargesum: 0.00000
title: Mulliken charges with hydrogens summed into heavy atoms:
elementType: O N N N C C C C C C C C
charge: -0.155272 -0.016644 -0.069743 0.048745 0.329203 -0.050483 -0.111978 -0.111984 0.082812 0.025514 0.025508 0.004323
polarizability: 1.43542780e+02 -5.70848149e+00 7.89247397e+01 8.90727916e-03 3.23483935e-02 8.74573829e+01
1716.lowfreq: -55.6151 -10.1933 -0.0010 -0.0008 -0.0006 4.2947 4.7328 82.7816 99.5911
frequency: -55.5642 82.7807 99.5646 230.4939 256.8701 318.9133 343.7323 397.2291 399.9496 408.7097 467.0916 531.7806 545.9208 613.3264 657.5003 698.6235 710.3598 723.5131 742.2119 772.7205 831.1922 856.7412 915.0489 929.1434 979.9755 988.0260 1001.0523 1010.5099 1045.4904 1056.8593 1078.5654 1175.1485 1188.7868 1273.3811 1313.1242 1344.2670 1371.4783 1429.7464 1457.2462 1522.2979 1560.4748 1584.7395 1615.3347 1623.4531 3130.8542 3137.6665 3148.0877 3157.7391 3170.8562 3568.0779 3711.6596
redmass: 4.4544 5.0406 5.9783 3.9351 7.2711 7.4373 1.1568 2.6649 3.6910 1.5766 2.4145 3.7711 12.5331 6.5472 6.7898 3.3157 2.4127 6.7741 11.0406 2.0338 12.6193 1.2428 5.1051 1.5190 1.3860 6.1214 1.3575 4.1809 1.9597 2.2304 1.6061 1.0538 1.1144 4.9777 1.3587 5.5211 7.1886 2.1883 2.6169 5.5501 3.6245 5.9917 6.2962 1.4014 1.0850 1.0882 1.0929 1.0971 1.1019 1.0448 1.1053
irintensity: 1.3546 2.4543 0.8400 3.3265 0.0016 1.7281 65.6367 12.6592 7.0599 151.7305 48.8574 13.5360 4.8831 1.1637 10.0185 12.6915 47.1882 12.0887 0.9631 40.2904 19.0830 0.2382 7.0631 3.5165 0.1603 0.3980 0.9893 16.1789 2.3591 14.7921 8.5699 0.0092 0.6987 20.1160 0.1681 1.7188 0.2153 9.2372 17.4117 3.7529 70.2012 1.6036 0.8219 211.1871 0.4406 0.6816 13.9460 26.4137 15.4812 65.4998 59.3855
temp: 298.150 k
press: 1.00000 atm
elementType: 8 7 7 7 6 6 6 6 6 6 6 6 1 1 1 1 1 1 1
symmnumber: 1
zpe: 365927.6 jmol-1
zpe.correction: 0.139374 hartree
zpe.thermalcorrener: 0.148404 hartree
zpe.thermalcorrenthalpy: 0.149348 hartree
zpe.thermalcorrgfe: 0.104959 hartree
zpe.sumelectzpe: -547.612398 hartree
zpe.sumelectthermal: -547.603369 hartree
zpe.sumelectthermalent: -547.602425 hartree
zpe.sumelectthermalfe: -547.646814 hartree
dipole: -4.7482 4.4723 -0.0064
dipole: 6.5228
quadrupole: -74.8642 -68.4707 -63.5958
quadrupole: 6.5411 -0.0077 0.0123
quadrupole: -5.8873 0.5062 5.3811 6.5411 -0.0077 0.0123
hfenergy: -547.7517726 hartree
pointgroup: C01 [X(C8H7N3O1)]
dipole: -1.8757434 1.7513859 0.0001006 debye
dipolederiv: -0.4882374 0.1727061 -0.0002179 0.2712566 -0.135066 0.0001496 0.0008458 -0.0005888 -0.0953094 0.166277 -0.3470738 -0.0000806 -0.2276421 -0.0990928 -0.0002939 -0.00045 0.0002933 -0.1197359 -0.1991653 0.3440825 0.0002687 -0.4393992 -0.2318347 0.0001197 -0.0004033 0.0005016 -0.1858211 -0.2295684 0.170229 0.0000468 0.2108644 -1.110796 0.0000152 0.0000838 -0.0000771 -0.6597839 0.2232348 0.0252211 0.0000171 -0.0766607 -0.0754303 0.0000552 0.0000385 0.0000447 0.0449229 0.4807879 -0.0164578 0.000127 0.2891793 -0.1888917 0.0000168 0.0000353 0.000036 -0.0135267 -0.1046276 -0.0161048 -0.0898879 -0.011669 -0.1168076 0.0313117 0.0176822 0.0006766 0.0436293 -0.104597 -0.0160529 0.0898698 -0.0119176 -0.1168516 -0.0312009 -0.0176277 -0.0005725 0.0436067 -0.1780387 -0.327857 -0.0001001 -0.1301472 1.2747978 -0.0000257 -0.0001184 -0.0001608 0.1813127 -0.0412944 -0.0123985 0.1087251 -0.0077994 -0.1415302 -0.0057525 0.0802688 -0.0067946 0.073733 -0.0413264 -0.0124689 -0.1087028 -0.0078428 -0.141519 0.0059132 -0.0802872 0.0069641 0.0737463 0.1147897 -0.0352433 0.000005 -0.0217462 -0.147532 0.0000389 0.0000211 0.0000375 -0.0457089 0.0559752 0.0117434 0.0860503 0.0147204 0.1427738 -0.0110845 0.078456 -0.0033738 -0.0202222 0.0559498 0.0116794 -0.0860684 0.0146782 0.1427788 0.010946 -0.0784804 0.0032532 -0.0202396 0.0167522 0.0100513 -0.0810867 0.0144615 0.1559771 0.0086558 -0.0947779 0.0063715 -0.0583434 0.016763 0.0101137 0.0810729 0.0145516 0.1559593 -0.0088143 0.0947751 -0.0065364 -0.0583491 -0.1216276 0.0252165 -0.0000058 0.0277162 0.1586162 -0.0000269 -0.000007 -0.0000261 0.0904376 0.1618702 0.0314965 -0.0000227 0.0305587 0.2399059 -0.0000086 -0.0000434 -0.0000299 0.3831759 0.2160831 -0.0288826 -0.0000097 0.0468373 0.234543 -0.0000146 -0.0000114 -0.0000184 0.342476 unknown
polarizability: 143.5913742|-5.4262727|78.8760679|0.0006457|0.0194828|87.4574608 unknown
InChI: InChI=1S/C8H7N3O/c9-8-7(10-12-11-8)6-4-2-1-3-5-6/h1-5H,9H2
charge 0 multiplicity 1
19 atoms
O  2.979904 -1.126934 -0.000836
N  1.57925 -1.481265 0.000233
N  3.142984 0.330681 0.000168
N  1.537685 2.131353 0.00024
C  -0.563396 -0.19369 -0.000089
C  0.918406 -0.310451 -0.000052
C  -1.276003 -0.124077 -1.225567
C  -1.275944 -0.123141 1.225365
C  1.869783 0.796089 0.000115
C  -2.682443 0.010294 -1.223739
C  -2.682385 0.011245 1.223497
C  -3.387987 0.079313 -0.000131
H  -0.729289 -0.188875 -2.172675
H  -0.729192 -0.187225 2.172501
H  -3.225441 0.054685 -2.173966
H  -3.225337 0.056366 2.173715
H  -4.478839 0.179952 -0.000146
H  2.266506 2.838895 0.00043
H  0.561338 2.411885 0.000138
