program: Gaussian 09
title: 000139129
version: EM64L-G09RevD.01
frameworkgroup: C1[X(C8H6N2O)]
method: RPBEPBE
basis: SDD
operation: Freq
keyword: #pfreq=noraman
keyword: PBEPBE/SDD
title: #p freq=noraman PBEPBE/SDD
converged: YES YES NO NO
title: Mulliken charges:
elementType: O N N C C C C C C C C H H H H H H
charge: -0.144035 -0.061329 -0.004674 0.389974 0.067648 -0.358712 -0.349876 -0.225876 -0.221079 -0.229185 -0.337869 0.220322 0.271509 0.233514 0.235835 0.236482 0.277351
chargesum: 0.00000
title: Mulliken charges with hydrogens summed into heavy atoms:
elementType: O N N C C C C C C C C
charge: -0.144035 -0.061329 -0.004674 0.389974 0.067648 -0.138390 -0.078367 0.007638 0.014756 0.007297 -0.060518
polarizability: 1.55399267e+02 -2.27518775e-01 1.03071712e+02 -9.31221409e-04 -5.42384812e-03 4.01358584e+01
1716.lowfreq: -4.3796 -3.6243 -0.0010 -0.0007 -0.0002 9.1781 30.5833 111.3702 152.3440
frequency: 30.5383 111.3690 152.3356 286.8927 338.9481 398.3339 422.0616 493.6081 579.0899 614.3910 655.1185 682.6921 683.4766 696.9632 781.5745 844.3985 848.1085 858.9105 928.6595 934.2437 944.9152 984.6356 989.8160 1005.8776 1025.1710 1066.4666 1093.6696 1177.3233 1191.3946 1202.6632 1292.6417 1345.1119 1371.5372 1387.8343 1444.3034 1469.0608 1523.4720 1589.1316 1617.4371 3130.5445 3138.1238 3149.6625 3160.5955 3172.3873 3239.2437
redmass: 4.8256 5.8823 5.5449 5.3081 7.8550 2.7808 5.7364 3.5797 11.8730 6.4640 8.9082 2.5408 7.7460 2.1014 1.8184 12.0277 1.3585 1.3544 11.4832 1.4334 7.6898 1.3875 6.2218 1.3360 2.4972 1.8840 1.7950 1.0644 1.3702 1.3469 2.7446 1.8260 4.6986 7.7960 2.4242 3.0244 4.5098 6.1242 5.9847 1.0855 1.0881 1.0925 1.0965 1.1016 1.0973
irintensity: 2.8268 0.2077 3.2711 1.1165 0.2338 0.0104 4.5395 9.3815 4.2696 0.0642 1.8891 13.4659 8.6796 37.2215 68.4061 19.6752 11.3062 12.8015 4.9241 4.7885 13.3047 0.1781 0.3425 0.2741 2.7102 1.7788 11.8093 0.0196 3.1588 0.9477 6.9247 3.0567 9.5398 9.3611 21.3329 34.9953 9.9001 1.8217 1.8906 3.1806 2.2878 20.2433 17.8836 15.2313 0.8128
temp: 298.150 k
press: 1.00000 atm
elementType: 8 7 7 6 6 6 6 6 6 6 6 1 1 1 1 1 1
symmnumber: 1
zpe: 323319.1 jmol-1
zpe.correction: 0.123146 hartree
zpe.thermalcorrener: 0.131388 hartree
zpe.thermalcorrenthalpy: 0.132332 hartree
zpe.thermalcorrgfe: 0.088714 hartree
zpe.sumelectzpe: -492.338893 hartree
zpe.sumelectthermal: -492.330650 hartree
zpe.sumelectthermalent: -492.329706 hartree
zpe.sumelectthermalfe: -492.373325 hartree
dipole: 4.4608 2.1684 0.0104
dipole: 4.9599
quadrupole: -69.0451 -56.8621 -66.4670
quadrupole: -3.3938 -0.0118 -0.0256
quadrupole: -4.9203 7.2626 -2.3423 -3.3938 -0.0118 -0.0256
hfenergy: -492.4620387 hartree
pointgroup: C01 [X(C8H6N2O1)]
dipole: -1.7509417 0.8559004 -0.0974642 debye
dipolederiv: -0.5708758 0.1341461 -0.0199434 0.0655267 -0.1224266 0.0042507 -0.0139695 0.0055818 -0.0837831 0.0629119 -0.2484134 0.0213749 0.0834378 -0.1560315 0.0033538 -0.0026799 -0.003733 -0.1331443 -0.0569932 -0.1074372 0.0090333 -0.2727717 0.0284415 -0.0168273 0.0200549 -0.0134632 -0.1313551 -0.0179552 0.0209345 -0.0027185 -0.0400073 0.0262495 -0.0002716 0.0026542 0.000804 0.0335102 0.7735961 0.050905 0.0114278 0.187021 -0.0974833 0.0169254 0.0017499 0.0144962 0.0957539 -0.0085226 0.0808421 -0.0016983 -0.0214896 0.0228361 -0.0112068 0.0051353 -0.0090911 -0.1518759 -0.037684 -0.1050565 0.0086147 0.0052239 -0.0028653 -0.0075482 0.0011418 -0.0104668 -0.1308086 -0.0728748 -0.1223895 0.0092605 -0.1749243 0.0764532 -0.0177281 0.012206 -0.0164757 -0.1444285 -0.0700803 0.1424927 -0.0073195 0.175021 0.0848833 -0.0103277 -0.0093205 -0.0110756 -0.1425553 0.090195 -0.0043839 0.0055267 -0.0064115 -0.0178726 -0.0083146 0.0055523 -0.0080976 -0.1473639 -0.2865489 0.149887 -0.0156389 -0.0036819 0.1474921 -0.0135033 -0.0051302 -0.009963 -0.0415611 0.0352236 -0.1081968 0.0041605 -0.0932757 -0.0423285 0.0099014 0.0032735 0.0096747 0.1504078 0.0808716 0.0757135 -0.0063381 0.0578809 0.0194247 0.0097155 -0.0049942 0.010325 0.1574581 0.0268121 0.076236 -0.0076956 0.0994139 -0.061435 0.0160223 -0.0091918 0.0155286 0.159798 0.0230154 -0.0803101 0.0020387 -0.0985843 -0.055497 0.0111777 0.0032742 0.0115417 0.1581132 -0.118319 0.0006852 -0.0061876 0.0008627 0.0946892 0.0041937 -0.0061379 0.0042018 0.1617314 0.1472281 0.0443453 -0.0038974 0.0367582 0.0554703 0.010187 -0.0036181 0.0102121 0.190103 unknown
polarizability: 155.345967|0.1712186|102.8103574|2.4950428|-4.037857|40.4505131 unknown
InChI: InChI=1S/C8H6N2O/c1-2-4-7(5-3-1)8-6-9-11-10-8/h1-6H
charge 0 multiplicity 1
17 atoms
O  3.14867 -0.750327 0.183976
N  1.767498 -1.162579 0.182729
N  3.243186 0.699566 0.086109
C  -0.422422 -0.003913 0.055303
C  1.049992 -0.01543 0.088252
C  -1.1351 1.221646 -0.036575
C  -1.148331 -1.225561 0.115484
C  -2.545681 1.225439 -0.067721
C  -2.556362 -1.216852 0.084088
C  -3.261325 0.0077 -0.007593
C  1.967316 1.106181 0.030862
H  -0.595526 2.174276 -0.083763
H  -0.597481 -2.169089 0.186226
H  -3.08497 2.176045 -0.138773
H  -3.105941 -2.163012 0.131031
H  -4.356387 0.011914 -0.031835
H  1.745263 2.168196 -0.047598
