program: Gaussian 09
title: 000139124
version: EM64L-G09RevD.01
frameworkgroup: C1[X(C5H10Br2)]
method: RPBEPBE
basis: SDD
operation: Freq
keyword: #pfreq=noraman
keyword: PBEPBE/SDD
title: #p freq=noraman PBEPBE/SDD
converged: YES YES NO NO
title: Mulliken charges:
elementType: Br Br C C C C C H H H H H H H H H H
charge: -0.015294 0.013429 -0.034315 -0.408908 -0.690603 -0.686518 -0.674230 0.248633 0.311699 0.223694 0.229807 0.206114 0.210600 0.220441 0.245264 0.287744 0.312443
chargesum: 0.00000
title: Mulliken charges with hydrogens summed into heavy atoms:
elementType: Br Br C C C C C
charge: -0.015294 0.013429 0.214318 -0.097209 -0.030988 -0.010213 -0.074042
polarizability: 9.83316469e+01 5.93826440e+00 9.36438075e+01 -4.07297082e+00 1.67891309e+00 6.10375250e+01
1716.lowfreq: -11.7397 -7.4414 0.0004 0.0004 0.0006 0.5588 58.8775 73.2476 126.1009
frequency: 58.8726 73.2379 126.0999 175.5557 195.1523 224.5678 231.9766 281.5513 320.5647 387.6452 485.0659 584.8608 659.0971 800.5772 871.5151 917.7849 942.8286 955.3978 1008.2224 1094.8400 1102.3680 1147.6083 1191.5030 1215.7826 1227.4017 1292.7894 1308.2076 1354.4546 1381.7384 1400.2616 1424.3094 1466.1821 1474.5967 1484.9657 1486.8037 2976.9344 2981.7763 3005.8575 3046.7522 3069.5196 3071.5207 3077.7094 3080.7546 3088.1737 3140.8849
redmass: 6.5255 2.6134 5.8746 3.0803 1.2929 2.7680 1.0813 2.6544 3.7170 2.4142 3.0529 3.0426 3.8114 3.1610 1.5439 1.3124 1.9661 1.3918 1.9671 1.8750 1.1352 1.9150 2.1151 1.2160 1.1930 1.3309 1.3466 1.3814 1.2000 1.2082 1.0964 1.0458 1.0510 1.0428 1.0546 1.0356 1.0368 1.0843 1.0587 1.0982 1.0914 1.0961 1.0987 1.0998 1.1065
irintensity: 0.3663 0.1454 0.5904 1.3658 0.3994 2.6214 0.4113 0.3099 7.8437 1.8832 1.8281 21.8160 40.6524 1.2818 23.3896 12.3689 13.4230 0.5833 2.6290 4.5069 6.5934 3.5237 9.0132 29.4891 9.7051 24.3610 4.6638 0.3544 23.4445 15.6690 8.2201 1.4055 8.3084 17.1058 15.9992 27.7782 21.0129 5.9120 12.8011 10.0364 5.7583 45.9945 51.8056 25.5944 2.0632
temp: 298.150 k
press: 1.00000 atm
elementType: 35 35 6 6 6 6 6 1 1 1 1 1 1 1 1 1 1
symmnumber: 1
zpe: 364228.6 jmol-1
zpe.correction: 0.138727 hartree
zpe.thermalcorrener: 0.148256 hartree
zpe.thermalcorrenthalpy: 0.149200 hartree
zpe.thermalcorrgfe: 0.101755 hartree
zpe.sumelectzpe: -222.868425 hartree
zpe.sumelectthermal: -222.858896 hartree
zpe.sumelectthermalent: -222.857952 hartree
zpe.sumelectthermalfe: -222.905397 hartree
dipole: -2.4582 -2.8909 0.1872
dipole: 3.7994
quadrupole: -64.1815 -63.1700 -61.8498
quadrupole: 3.5669 0.1521 0.3397
quadrupole: -1.1144 -0.1029 1.2173 3.5669 0.1521 0.3397
hfenergy: -223.0071519 hartree
pointgroup: C01 [X(C5H10Br2)]
dipole: -1.3261181 0.6491056 -0.2333567 debye
dipolederiv: -0.2337158 0.1543172 -0.0083676 0.1777947 -0.5873412 0.0893875 0.0037255 0.0451786 -0.1486838 -0.5041579 -0.1459541 0.0293725 -0.1337683 -0.1307924 0.0051526 -0.0544456 -0.0278662 -0.1254198 0.175942 -0.0139245 0.0052383 0.0406362 -0.1139668 0.0469601 0.1246644 0.0098057 0.1142081 0.0603452 -0.3848463 0.0305855 -0.2060409 0.8710514 -0.1560153 -0.1247656 -0.1369576 0.0550102 -0.0885486 0.1380527 -0.0163683 -0.017653 0.0336874 -0.0492216 -0.0535176 -0.0291282 0.0632684 -0.0164203 0.0283995 -0.0584457 0.0472111 0.0276589 -0.0646647 -0.0330034 -0.076149 -0.0405782 0.7030034 0.3493502 0.0453648 0.1659365 -0.0451788 0.0844273 0.1329206 0.0560464 0.0535709 -0.0230525 -0.0491103 0.0410289 -0.0480431 -0.0155101 0.0790603 0.0291001 0.0763357 -0.0499586 0.0357342 0.0504326 -0.0274883 0.0019574 -0.085725 -0.0544454 -0.0173211 -0.0169653 -0.0381075 0.0928247 -0.0385525 -0.0915946 -0.012475 0.0479657 -0.0634348 -0.0514233 -0.0903273 -0.1224672 -0.1827274 0.0429187 0.0034554 0.0141638 0.0430636 0.0030361 -0.0091003 -0.0033244 0.1069491 0.0825325 -0.0759404 0.0753686 -0.0384932 -0.0435446 0.073057 0.0590069 0.1323037 -0.0351354 0.0799026 -0.066829 0.0650561 -0.0588104 -0.0385562 0.1282414 0.0437427 0.078921 -0.0394967 -0.1928417 -0.0210684 -0.0435008 -0.0061007 0.1057545 0.0000555 0.0032702 0.0084037 0.0756854 0.1021853 0.0863952 0.047001 0.0552572 -0.0807557 -0.0736986 0.0263012 -0.0457732 0.0605461 -0.0574843 0.0158661 -0.0411697 0.039837 -0.0558443 0.033935 -0.0509837 0.0660822 0.0774032 -0.0335215 -0.0695067 -0.055536 -0.0214095 0.0680334 -0.0818323 -0.0281709 -0.0465859 -0.0067942 unknown
polarizability: 101.6333309|-1.8080416|90.2622841|4.6833009|-2.328714|61.1173644 unknown
InChI: InChI=1S/C5H10Br2/c1-4(2)5(7)3-6/h4-5H,3H2,1-2H3
charge 0 multiplicity 1
17 atoms
Br 0.876781 -2.057215 0.565192
Br 2.898395 1.022451 -0.07653
C  -1.328806 -0.099433 0.284358
C  0.213886 -0.115112 0.480124
C  -1.890003 1.306773 0.633398
C  -1.783268 -0.552879 -1.121386
C  0.984602 0.632379 -0.604674
H  -1.733804 -0.813901 1.026967
H  0.470712 0.264987 1.482795
H  -1.575927 1.635712 1.641285
H  -2.994271 1.28025 0.615593
H  -1.567291 2.073473 -0.095553
H  -1.474498 0.167039 -1.902526
H  -2.885032 -0.624923 -1.156694
H  -1.368381 -1.544082 -1.375223
H  0.541703 1.6275 -0.77553
H  1.050303 0.071981 -1.547497
