program: Gaussian 09
title: 000139122
version: EM64L-G09RevD.01
frameworkgroup: C1[X(C6H10O2)]
method: RPBEPBE
basis: SDD
operation: Freq
keyword: #pfreq=noraman
keyword: PBEPBE/SDD
title: #p freq=noraman PBEPBE/SDD
converged: YES YES NO NO
title: Mulliken charges:
elementType: O O C C C C C C H H H H H H H H H H
charge: -0.426007 -0.223906 0.127337 -0.735472 -0.690525 -0.060222 0.155448 -0.581470 0.228301 0.248521 0.211011 0.231091 0.236279 0.226846 0.240954 0.212214 0.220938 0.378664
chargesum: 0.00000
title: Mulliken charges with hydrogens summed into heavy atoms:
elementType: O O C C C C C C
charge: -0.047343 -0.223906 0.127337 -0.047640 0.003690 0.180733 0.155448 -0.148318
polarizability: 8.38226223e+01 -2.40796363e+00 6.77402228e+01 4.84032956e+00 2.40356399e+00 5.62177130e+01
1716.lowfreq: -14.0286 -0.0009 -0.0008 -0.0008 3.5337 12.9036 26.7911 70.9026 197.6462
frequency: 26.4586 70.5590 197.6405 218.6996 238.2280 261.0696 297.4938 325.2454 337.5986 417.7174 481.4536 564.2315 599.5357 668.5570 689.3681 731.0470 846.1004 926.1202 940.7786 947.0904 1001.6984 1008.3060 1026.8579 1043.2441 1138.3809 1185.6033 1252.3283 1282.6714 1312.8608 1371.9192 1393.8257 1424.1223 1463.6175 1468.4270 1483.0907 1490.6973 1645.7827 1660.5049 2987.2791 2995.6975 3087.6160 3090.7481 3097.1484 3099.6247 3113.5882 3116.0924 3201.4216 3512.6388
redmass: 7.1658 2.5050 1.3715 2.4684 2.0709 1.0763 1.9926 2.5427 2.7264 3.7960 3.9108 2.7105 1.2462 2.1038 2.9631 4.7687 2.2150 1.8428 1.3428 1.5272 1.1202 1.3071 2.7188 1.5585 2.5334 1.8872 3.2127 2.0219 1.4025 1.1765 1.2126 1.1758 1.0515 1.0484 1.0572 1.0634 9.0999 4.7884 1.0335 1.0363 1.1007 1.0990 1.0613 1.1014 1.0980 1.0944 1.1140 1.0640
irintensity: 0.5649 0.0047 0.2602 0.8587 0.3767 0.0287 1.3190 4.0058 3.0974 12.7195 3.3822 16.4964 105.7247 42.7925 11.6021 21.0641 4.5269 2.1172 75.8091 4.2164 14.7995 4.9479 288.5708 28.4614 4.1305 6.5612 0.3005 15.6592 2.6271 15.0310 5.6846 16.0166 4.3527 3.1643 18.0683 20.5373 228.9046 12.2623 23.2581 18.3381 18.4499 24.3954 10.6511 20.8042 25.3092 2.2145 22.7672 21.7872
temp: 298.150 k
press: 1.00000 atm
elementType: 8 8 6 6 6 6 6 6 1 1 1 1 1 1 1 1 1 1
symmnumber: 1
zpe: 387235.9 jmol-1
zpe.correction: 0.147490 hartree
zpe.thermalcorrener: 0.156943 hartree
zpe.thermalcorrenthalpy: 0.157887 hartree
zpe.thermalcorrgfe: 0.112798 hartree
zpe.sumelectzpe: -384.431547 hartree
zpe.sumelectthermal: -384.422094 hartree
zpe.sumelectthermalent: -384.421150 hartree
zpe.sumelectthermalfe: -384.466239 hartree
dipole: 0.1102 -1.8112 0.1472
dipole: 1.8205
quadrupole: -42.6137 -53.9332 -48.1222
quadrupole: -0.8505 -0.2995 0.4477
quadrupole: 5.6093 -5.7102 0.1008 -0.8505 -0.2995 0.4477
hfenergy: -384.5790371 hartree
pointgroup: C01 [X(C6H10O2)]
dipole: 0.0561727 -0.7043593 -0.1170433 debye
dipolederiv: -0.9911646 0.4145088 0.2581075 0.3328805 -0.4913985 -0.0998636 0.2514906 -0.1092949 -0.485803 -0.6417411 -0.2055651 -0.0226788 0.0558465 -0.9321442 -0.2148288 0.0873771 -0.2034123 -0.3599816 0.0029682 -0.0696845 0.0275333 -0.1280988 -0.1191672 -0.022963 -0.0500086 0.0285919 0.0770747 -0.0143194 0.0136543 0.0072258 0.0421945 0.0247732 -0.0430852 0.0345934 -0.0296599 -0.0177919 -0.0858984 -0.0077244 -0.0186005 0.0401432 0.0439563 0.0277084 0.0004714 -0.0409104 0.0507305 0.1812874 -0.1381002 0.1025331 -0.189867 -0.0035072 0.1115575 0.0124225 0.1321616 -0.0616226 1.366437 0.0339822 -0.2703911 -0.0904895 1.2142873 0.3608335 -0.2921374 0.3579336 0.308724 -0.2259991 -0.0584221 0.0179825 -0.0742337 -0.1372101 0.2312529 0.0402703 0.2335555 -0.1214296 0.0955394 0.0069154 -0.0379289 0.0111903 -0.0077583 0.1216657 -0.025131 0.0804031 -0.073117 -0.01022 0.1226951 0.0460671 0.1070017 0.0279571 -0.0335405 0.0237224 -0.010404 0.0905057 -0.076409 -0.1434764 -0.0155379 -0.1194377 0.0180236 -0.0039611 0.0123643 0.0046146 0.0637375 -0.0533438 -0.1183406 0.0092225 -0.1136517 0.0066109 0.0298033 -0.0017529 0.0143195 0.0807624 -0.0463712 0.1272256 0.0030537 0.1357444 -0.0032648 0.0242717 0.0116669 -0.0130852 0.0681636 0.1078189 -0.0091995 -0.0193726 -0.0189869 0.0318724 -0.1156944 -0.0132071 -0.0553409 -0.1069579 0.0765366 0.0037535 -0.0486686 0.0469248 0.0389228 -0.1065929 -0.0185852 -0.1153459 0.0084092 -0.0267992 0.1165786 0.0082821 0.128896 0.0547623 -0.0792145 0.022886 -0.0918128 0.1043611 0.1096719 0.0035798 -0.0355221 -0.0161774 0.0473115 -0.1413468 -0.0542551 -0.1214738 0.0102011 0.2320064 -0.0923804 -0.0113073 -0.1498791 0.1859729 -0.0460022 -0.0421876 -0.0608398 0.3640338 unknown
polarizability: 83.6651173|-3.4161824|65.8131724|4.7616747|4.8136128|58.3022683 unknown
InChI: InChI=1S/C6H10O2/c1-4-6(2,3)5(7)8/h4,7H,1H2,2-3H3
charge 0 multiplicity 1
18 atoms
O  2.213214 -0.305627 -0.432767
O  1.281225 1.608992 0.469579
C  -0.177802 -0.379398 0.048302
C  -0.339836 -1.144524 -1.289272
C  -0.054461 -1.409704 1.227732
C  -1.336486 0.568551 0.354298
C  1.126163 0.439716 0.053331
C  -2.541038 0.585811 -0.264891
H  -0.448963 -0.448793 -2.139636
H  0.535788 -1.786796 -1.473953
H  -1.239294 -1.784369 -1.246679
H  -0.972243 -2.02173 1.265277
H  0.815652 -2.071326 1.074242
H  0.056938 -0.895114 2.198984
H  -1.142515 1.27271 1.175446
H  -3.323461 1.285059 0.050334
H  -2.786117 -0.076098 -1.102903
H  3.035436 0.252839 -0.375027
