program: Gaussian 09
title: 000139120
version: EM64L-G09RevD.01
frameworkgroup: C1[X(C3H6OS)]
method: RPBEPBE
basis: SDD
operation: Freq
keyword: #pfreq=noraman
keyword: PBEPBE/SDD
title: #p freq=noraman PBEPBE/SDD
converged: YES YES NO NO
title: Mulliken charges:
elementType: S O C C C H H H H H H
charge: 0.652107 -0.632289 -0.800063 -0.368084 -0.436026 0.289960 0.273342 0.241386 0.255476 0.236088 0.288104
chargesum: 0.00000
title: Mulliken charges with hydrogens summed into heavy atoms:
elementType: S O C C C
charge: 0.652107 -0.632289 0.004625 -0.112608 0.088165
polarizability: 7.16711170e+01 -3.62632499e+00 5.73359535e+01 -2.54376553e+00 5.04470506e+00 3.78064291e+01
1716.lowfreq: -18.1530 -9.6361 -0.0030 -0.0016 -0.0013 9.3616 130.2195 147.3855 208.8664
frequency: 130.2167 147.3405 208.8649 238.9473 292.3419 448.9466 495.8012 547.3431 615.7528 789.0795 923.9716 939.2988 954.9521 965.3061 997.4926 1198.2263 1300.9305 1357.9661 1415.2490 1431.0714 1604.0903 3015.4777 3051.0778 3155.1537 3163.2234 3168.4767 3200.1563
redmass: 2.7840 1.0392 2.9036 3.8770 3.2626 4.1136 4.6714 5.3060 1.5376 12.9615 1.1648 1.2121 1.2424 1.3162 1.2025 1.3159 1.1400 1.1447 1.0527 1.0568 4.8413 1.0256 1.0618 1.1052 1.0980 1.1071 1.1135
irintensity: 0.8678 0.2461 3.6200 9.3021 4.2908 1.6133 5.5368 7.1699 47.6435 31.5574 5.9236 11.3827 15.0154 8.3263 97.9605 16.3051 4.4822 26.5460 12.3464 14.9593 15.9165 9.4491 5.9275 5.2508 5.8182 4.8125 2.1338
temp: 298.150 k
press: 1.00000 atm
elementType: 16 8 6 6 6 1 1 1 1 1 1
symmnumber: 1
zpe: 213872.9 jmol-1
zpe.correction: 0.081460 hartree
zpe.thermalcorrener: 0.088287 hartree
zpe.thermalcorrenthalpy: 0.089231 hartree
zpe.thermalcorrgfe: 0.051180 hartree
zpe.sumelectzpe: -590.678638 hartree
zpe.sumelectthermal: -590.671811 hartree
zpe.sumelectthermalent: -590.670867 hartree
zpe.sumelectthermalfe: -590.708918 hartree
dipole: -0.0534 -4.3691 -0.4809
dipole: 4.3958
quadrupole: -32.3652 -42.0308 -38.7047
quadrupole: -1.4999 -0.8153 -0.0463
quadrupole: 5.3351 -4.3306 -1.0045 -1.4999 -0.8153 -0.0463
hfenergy: -590.7600979 hartree
pointgroup: C01 [X(C3H6O1S1)]
dipole: -0.0213653 1.7279276 -0.0689468 debye
dipolederiv: 0.4336939 0.0185779 -0.0747363 -0.0892015 0.7497856 -0.3611983 -0.1173587 -0.1023717 0.4045883 -0.4455997 0.0044576 0.039229 0.08444 -0.6093375 0.2981374 0.0342736 -0.1443241 -0.3944566 -0.09712 -0.0393895 -0.0175042 -0.0444473 -0.129063 0.0626641 0.0543228 0.1163395 -0.1101336 0.16423 -0.1173469 0.1539429 -0.0246955 -0.1119308 0.0738609 0.114376 0.0998657 -0.2748374 -0.2591348 -0.0362017 0.0528107 -0.0048426 -0.0853679 0.0560541 0.0318465 0.0586392 -0.2622966 0.0615757 -0.0426333 -0.0415599 -0.03804 0.074979 -0.0087686 -0.0118943 0.0153264 -0.0459648 -0.0793226 0.0279184 -0.0097546 0.0445047 0.0773929 0.023778 0.0248238 0.0313611 0.1065763 0.0771286 -0.0254705 0.0368571 -0.0470375 -0.1124895 -0.0327281 0.0531625 -0.0130783 0.0691448 -0.0118804 0.0752299 -0.0513836 0.0827772 -0.0483163 -0.069031 -0.0905824 -0.0449123 0.1620981 -0.0357055 0.0891572 -0.0715986 0.0410114 0.1333799 -0.0034641 -0.0665701 -0.000043 0.1770881 0.1921348 0.0457008 -0.0163023 -0.0044689 0.0609677 -0.0393045 -0.0263998 -0.0168025 0.1681932 unknown
polarizability: 71.2530914|3.8649609|58.4071841|4.1904538|2.2211268|37.1532242 unknown
InChI: InChI=1S/C3H6OS/c1-3-5(2)4/h3H,1H2,2H3
charge 0 multiplicity 1
11 atoms
S  0.611926 -0.065049 0.836858
O  0.438077 -1.580962 0.146003
C  1.766866 0.87398 -0.395239
C  -0.994942 0.842785 0.325523
C  -1.904802 0.099558 -0.328768
H  1.351885 0.691583 -1.396441
H  2.759702 0.41578 -0.280171
H  1.783975 1.944815 -0.139978
H  -1.068492 1.881546 0.661722
H  -2.874871 0.505039 -0.634805
H  -1.656824 -0.949275 -0.560203
