program: Gaussian 09
title: 000139119
version: EM64L-G09RevD.01
frameworkgroup: C1[X(C11H12N2)]
method: RPBEPBE
basis: SDD
operation: Freq
keyword: #pfreq=noraman
keyword: PBEPBE/SDD
title: #p freq=noraman PBEPBE/SDD
converged: YES YES NO NO
title: Mulliken charges:
elementType: N N C C C C C C C C C C C H H H H H H H H H H H H
charge: -0.164357 -0.117007 0.393698 0.079806 -0.526078 0.349592 -0.776429 -0.611639 -0.374073 -0.372711 -0.247057 -0.233030 -0.244020 0.248921 0.233684 0.233863 0.248692 0.229193 0.264547 0.229719 0.218958 0.266548 0.221478 0.222468 0.225234
chargesum: 0.00000
title: Mulliken charges with hydrogens summed into heavy atoms:
elementType: N N C C C C C C C C C C C
charge: -0.164357 -0.117007 0.393698 0.079806 -0.277156 0.349592 -0.060190 0.111820 -0.155115 -0.106163 -0.025578 -0.010562 -0.018786
polarizability: 2.12281519e+02 1.75601954e-01 1.30467280e+02 1.55442892e-02 -1.48146595e-02 6.22747456e+01
1716.lowfreq: -19.8882 -0.0005 0.0003 0.0006 0.9047 4.7443 23.4073 35.9491 82.4621
frequency: 15.3710 35.5076 82.4548 110.2010 117.9907 200.0594 213.2982 246.4139 320.4472 326.8285 334.6403 401.8581 503.8087 515.1692 614.4611 618.2409 631.8841 659.5393 688.3777 699.2739 760.2038 779.1998 819.0557 851.7369 926.2183 939.7887 978.7734 982.1565 988.3975 998.0637 1002.2073 1026.1352 1044.9269 1069.7590 1091.1356 1118.1831 1170.7504 1175.1706 1188.6828 1211.2334 1264.6422 1303.2612 1346.3502 1379.9100 1403.1386 1408.3336 1428.2335 1444.3534 1448.5393 1465.6736 1472.5988 1476.5455 1487.6677 1515.3476 1559.6874 1587.6873 1619.1126 2973.4533 2986.7747 3044.1998 3066.1170 3100.9576 3120.3649 3128.5980 3133.6821 3142.1815 3155.1927 3166.2512 3227.1308
redmass: 1.4451 1.8923 3.4922 1.0815 3.9784 3.4436 3.1279 2.6250 5.4103 4.7999 3.7311 2.8144 3.4967 3.4281 6.2437 4.6293 4.8823 5.7987 2.5757 2.0695 4.1136 1.7476 1.5683 1.2538 1.4728 6.5303 1.3719 1.7381 5.8856 1.3283 2.0625 2.1921 1.4661 1.7425 1.8801 1.3128 1.0675 2.8333 1.1348 1.9583 3.8704 2.0312 2.4834 7.1090 1.3761 1.9889 2.1604 1.7498 2.2352 1.0440 1.1851 1.0431 1.2369 3.7037 5.7667 6.2128 6.0924 1.0391 1.0360 1.0981 1.1017 1.0963 1.0843 1.0879 1.0980 1.0933 1.0962 1.1000 1.0987
irintensity: 0.0002 0.2463 4.9280 0.0643 1.9801 5.3242 0.3267 0.9149 0.1771 0.0334 1.3227 0.0048 6.5953 4.8587 1.0047 3.0928 5.9679 4.5927 19.6542 34.1219 7.4458 74.7519 20.2246 0.4634 5.4348 7.7400 0.0922 2.6005 2.9625 0.7755 27.0264 2.8289 4.8157 6.7212 10.1725 0.3566 0.0824 1.1455 0.4808 11.9996 5.3386 13.1550 25.1695 2.3264 5.7089 9.1715 11.8248 39.9074 31.9285 0.9255 7.5207 36.1135 7.3103 10.9092 24.1470 1.6852 17.4924 40.6373 73.1481 21.1632 27.0990 13.4470 3.8411 5.3513 4.0823 37.1948 28.7972 16.7971 2.1119
temp: 298.150 k
press: 1.00000 atm
elementType: 7 7 6 6 6 6 6 6 6 6 6 6 6 1 1 1 1 1 1 1 1 1 1 1 1
symmnumber: 1
zpe: 534213.9 jmol-1
zpe.correction: 0.203471 hartree
zpe.thermalcorrener: 0.215489 hartree
zpe.thermalcorrenthalpy: 0.216434 hartree
zpe.thermalcorrgfe: 0.163210 hartree
zpe.sumelectzpe: -534.936637 hartree
zpe.sumelectthermal: -534.924619 hartree
zpe.sumelectthermalent: -534.923675 hartree
zpe.sumelectthermalfe: -534.976899 hartree
dipole: 3.4002 -0.8584 0.0016
dipole: 3.5069
quadrupole: -56.4444 -69.3069 -82.0909
quadrupole: 1.3618 0.0053 -0.0072
quadrupole: 12.8363 -0.0261 -12.8102 1.3618 0.0053 -0.0072
hfenergy: -535.1401086 hartree
pointgroup: C01 [X(C11H12N2)]
dipole: 1.3388035 0.3334753 0.0043036 debye
dipolederiv: -0.8543061 0.2394792 0.0005758 0.1272225 -0.2330787 -0.0016618 -0.0054918 0.0020421 -0.0842076 0.1874397 -0.1874604 -0.0003698 -0.0581934 -0.4615423 -0.0017109 0.0016618 -0.0028257 -0.2211262 0.2545953 0.0393178 0.0007367 -0.0586073 0.3239638 0.0023328 0.0005216 0.0018434 -0.0219986 0.2327567 0.0993509 0.0010566 0.3444289 0.0851772 0.0010173 0.0032307 0.0005286 0.0096725 -0.4139674 0.0055584 0.000091 -0.0519842 -0.1035281 0.0010541 -0.0005075 0.0011651 -0.2552935 0.5790718 -0.0010785 0.001145 -0.0241723 -0.0221511 -0.0004459 0.0006775 -0.0002458 0.0403106 -0.0402037 -0.0754048 -0.0009206 -0.0041897 0.0258421 -0.0007997 0.0001622 -0.0007603 0.1107771 0.4120951 -0.2061331 -0.0023537 -0.322971 0.2506392 0.001504 -0.0011185 0.000774 0.2209636 -0.2030318 0.0527234 0.000243 0.1434584 0.0334233 0.0013087 0.0006794 0.001241 -0.1656805 -0.2228495 -0.0657086 -0.0004317 -0.1564882 0.0001078 0.000372 -0.0009077 0.0006825 -0.1539666 0.0380802 -0.0712752 0.0000603 -0.137986 0.0863166 0.000906 -0.0001181 0.0009897 -0.15955 0.0461718 0.0818563 0.0008674 0.1206028 0.1134786 0.0015608 0.0009902 0.0014958 -0.1541085 -0.0359042 0.0015327 0.0003944 0.0120606 -0.0706145 0.0006187 0.0004297 0.0005321 -0.1798456 0.1165977 0.0480016 0.000115 0.0373922 -0.0426827 -0.0016211 -0.0000954 -0.0016091 0.1946322 -0.057866 -0.0232385 -0.0788857 0.0166653 0.0759384 0.0792205 -0.1412235 0.0329742 -0.0434339 -0.0586479 -0.0249861 0.0783542 0.013659 0.0779507 -0.0766394 0.1414465 -0.0305144 -0.0451092 0.0810526 0.0706932 0.000657 -0.0318966 -0.1093892 -0.0022651 -0.0003923 -0.0020796 0.1225216 -0.0820848 0.079022 -0.0917042 0.0323667 0.0683294 -0.0578571 -0.1446147 0.0023455 -0.0598372 0.0971492 -0.1158563 0.000687 -0.0108801 -0.0178389 0.0003604 0.000479 0.0001308 0.1328106 -0.0808813 0.0797764 0.0916466 0.0346593 0.0667267 0.0573424 0.146212 -0.0040034 -0.0625709 0.05259 -0.1077055 -0.0007784 -0.0974181 -0.0652766 -0.0012811 -0.0007181 -0.0013715 0.1461489 0.0966205 0.0857203 0.0002549 0.0732139 -0.0024366 -0.0005648 0.0001677 -0.0005937 0.1524629 0.0021304 0.0916675 0.0001028 0.1243571 -0.079384 -0.0008979 0.0002523 -0.0009635 0.1576971 0.0106632 -0.0888277 -0.000765 -0.1187177 -0.0889649 -0.0014655 -0.0009239 -0.0013941 0.1544831 -0.1572715 -0.0070249 -0.0007788 -0.0065821 0.0889938 -0.0003874 -0.0007992 -0.0003837 0.1642479 unknown
polarizability: 212.2790042|-0.4351412|130.4666305|0.2969622|0.4187022|62.2779101 unknown
InChI: InChI=1S/C11H12N2/c1-9-8-11(12-13(9)2)10-6-4-3-5-7-10/h3-8H,1-2H3
charge 0 multiplicity 1
25 atoms
N  2.422731 -0.669544 0.011571
N  1.09389 -1.08197 0.005381
C  2.554087 0.715487 0.021154
C  0.368988 0.088764 0.011798
C  1.24593 1.224677 0.021634
C  -1.105988 0.052792 0.008435
C  3.887087 1.407379 0.028581
C  3.4818 -1.67709 0.004294
C  -1.869408 1.251665 0.012726
C  -1.795655 -1.191952 0.000639
C  -3.280194 1.209046 0.009247
C  -3.204406 -1.232829 -0.002799
C  -3.956253 -0.033004 0.001445
H  0.97533 2.278054 0.02846
H  4.489157 1.141531 0.918674
H  4.49016 1.158638 -0.865785
H  3.740385 2.499227 0.038966
H  4.124482 -1.587998 0.89877
H  2.995224 -2.662875 0.007049
H  4.113175 -1.587694 -0.898285
H  -1.360919 2.222442 0.018902
H  -1.207546 -2.115139 -0.002652
H  -3.851816 2.144238 0.012569
H  -3.719402 -2.200425 -0.00878
H  -5.051538 -0.06602 -0.001293
