program: Gaussian 09
title: 000139114
version: EM64L-G09RevD.01
frameworkgroup: C1[X(C12H7ClOS)]
method: RPBEPBE
basis: SDD
operation: Freq
keyword: #p
keyword: freq=noraman
keyword: PBEPBE/SDD
title: #p freq=noraman PBEPBE/SDD
converged: NO YES NO NO
title: Mulliken charges:
elementType: Cl S O C C C C C C C C C C C C H H H H H H H
charge: -0.050481 0.241564 -0.295326 -0.270469 0.458139 -0.281752 0.447240 -0.263136 -0.350989 -0.276596 -0.361962 -0.110079 -0.207263 -0.239749 -0.214069 0.268151 0.266880 0.243262 0.262347 0.261878 0.235615 0.236795
chargesum: 0.00000
title: Mulliken charges with hydrogens summed into heavy atoms:
elementType: Cl S O C C C C C C C C C C C C
charge: -0.050481 0.241564 -0.295326 -0.270469 0.458139 -0.281752 0.447240 0.005015 -0.084109 -0.033334 -0.099614 -0.110079 0.054615 -0.004135 0.022726
polarizability: 2.77057712e+02 -1.18460603e+00 1.53307384e+02 4.27186696e-03 1.50450837e-02 5.62120382e+01
1716.lowfreq: -25.1788 -0.0010 0.0013 0.0014 5.4143 5.9274 11.8867 88.5955 141.0358
frequency: -25.1551 88.5914 141.0335 145.5314 163.4413 247.3591 250.9991 296.7181 323.6078 388.3205 415.6897 425.8159 438.7660 442.1887 465.7630 518.1407 533.3365 616.6868 645.0439 659.9002 685.6321 695.2606 699.5368 756.2236 782.5842 811.0042 854.0762 860.0028 864.1185 936.1488 938.8673 975.5399 1021.6197 1038.8527 1048.2188 1082.1167 1120.4005 1134.2713 1169.8126 1180.6156 1225.6548 1252.0111 1269.2114 1363.4008 1373.0013 1383.7982 1427.5752 1453.6997 1465.0842 1571.3140 1579.6651 1595.3743 1607.9152 3134.4239 3146.9761 3158.9566 3162.8122 3164.1743 3176.9479 3184.3514
redmass: 10.0696 5.4401 6.2588 10.2061 6.4576 5.3906 9.0000 7.7108 7.5943 6.3657 11.6074 11.7496 3.1622 3.2124 8.7680 4.1018 4.5465 7.1376 7.4682 7.0589 4.1089 9.0438 3.9572 1.2423 7.4655 1.3838 1.3671 1.4021 7.0536 1.3708 1.3399 1.3140 5.0617 2.6017 4.0339 2.3661 1.5988 1.3679 1.0676 2.7782 3.2179 1.4713 1.4180 5.3478 5.1390 8.9379 2.2905 2.5838 2.5988 7.2518 7.3134 7.7756 7.1820 1.0874 1.0892 1.0925 1.0940 1.0888 1.1006 1.0974
irintensity: 0.6432 0.5548 0.1345 0.1050 1.8798 0.1996 0.6786 3.0412 0.4231 0.6486 1.9239 0.0925 2.2944 10.6387 4.7004 0.1995 6.4769 1.4569 0.7889 14.8777 1.4720 51.9919 0.1250 106.2676 36.5792 50.8094 0.0065 22.6035 2.4771 2.8466 1.2145 0.1477 1.0668 19.8109 13.4369 49.8365 12.1161 3.0912 0.1705 0.2665 257.8393 64.1866 6.3376 7.9206 34.8521 1.9283 33.4823 409.9214 11.9833 5.4969 23.1330 10.1111 10.4631 0.8742 6.8322 0.0168 14.3287 0.8943 15.3949 1.1174
temp: 298.150 k
press: 1.00000 atm
elementType: 17 16 8 6 6 6 6 6 6 6 6 6 6 6 6 1 1 1 1 1 1 1
symmnumber: 1
zpe: 398106.3 jmol-1
zpe.correction: 0.151631 hartree
zpe.thermalcorrener: 0.162688 hartree
zpe.thermalcorrenthalpy: 0.163633 hartree
zpe.thermalcorrgfe: 0.114399 hartree
zpe.sumelectzpe: -1393.784752 hartree
zpe.sumelectthermal: -1393.773694 hartree
zpe.sumelectthermalent: -1393.772750 hartree
zpe.sumelectthermalfe: -1393.821984 hartree
dipole: 2.3842 0.6845 0.0020
dipole: 2.4805
quadrupole: -93.3390 -91.1690 -106.2665
quadrupole: -3.4838 0.0105 0.0029
quadrupole: 3.5859 5.7558 -9.3417 -3.4838 0.0105 0.0029
hfenergy: -1393.9363825 hartree
pointgroup: C01 [X(C12H7Cl1O1S1)]
dipole: 0.9293036 -0.2979699 -0.0007838 debye
dipolederiv: -0.8802669 0.1786494 -0.0003436 0.2658969 -0.1862485 0.0001158 -0.0004609 0.0000993 -0.0621168 -0.6562788 -0.0282632 0.0000416 -0.0523805 -0.0809184 0.0000435 0.000065 -0.0002824 0.0223771 -2.0894003 -0.0620632 0.0001169 -0.0846288 -0.2838211 0.0001308 0.0000818 0.0004691 -0.178435 0.5106183 0.3199953 0.0005559 0.7770588 0.1245692 0.0001617 0.0002297 0.0002954 -0.0729886 1.2903368 -0.2777826 0.0002271 -0.7856371 -0.040844 -0.0001147 0.0003392 -0.0003588 0.1143255 0.5703633 -0.2754184 -0.0006516 -0.7256869 -0.0444347 0.0001957 -0.0003437 0.0003313 -0.0782849 1.1822174 0.3566698 -0.0003468 0.8557997 0.1179114 -0.0002339 -0.0004356 -0.0004249 0.1210558 -0.4962854 -0.0134529 -0.0001216 -0.0746933 -0.0240442 -0.0000078 -0.0002025 0.0000336 -0.0737984 -0.1338405 0.1001766 0.0001862 -0.0756587 0.0645311 -0.0000468 0.0000641 0.0000377 -0.1560498 -0.2173307 0.0286789 -0.0000246 0.1331062 0.0849218 -0.0000686 0.0000211 -0.000003 -0.1139785 -0.2772851 -0.113329 -0.000123 0.076679 0.0562716 -0.000101 0.0000042 0.0000562 -0.1658492 1.2115242 -0.2915769 0.000607 -0.3766472 0.2001315 -0.0002172 0.000836 -0.0001381 -0.079736 -0.2981286 0.0264337 -0.0001023 0.1146139 -0.0179947 0.000105 -0.0000289 0.0000304 -0.1214139 0.0031262 0.0642626 -0.0001612 0.0039755 -0.0519531 -0.0000745 -0.0002534 -0.0000575 -0.172433 0.0469557 0.0037124 -0.0001284 -0.0289798 0.0704348 0.0000708 -0.000239 -0.0000045 -0.1605194 0.1151152 -0.0089586 -0.0000609 0.0184306 -0.0031237 0.0000225 -0.0000678 -0.0000261 0.1640955 0.0703962 0.0458783 -0.0000623 0.0267008 -0.0171236 -0.0000014 -0.0000343 -0.000009 0.1739821 0.1095024 0.0331203 0.0000671 -0.014689 -0.0630316 0.0000416 0.0000679 -0.0000235 0.1582108 0.0936997 -0.0306545 0.0000727 -0.0087685 -0.0377654 0.0000085 0.0000373 -0.0000009 0.1747479 0.0062282 -0.0721611 -0.00008 -0.0643135 0.0520972 -0.0000347 -0.0000922 -0.0000354 0.1718796 -0.0937913 -0.0740053 0.0001848 -0.081863 0.0488007 0.0000656 0.0002166 0.0000713 0.1702844 -0.067476 0.0900881 0.0001468 0.1016849 0.0316336 -0.0000612 0.0001952 -0.0000603 0.1646449 unknown
polarizability: 277.0138678|-2.6128607|153.3512276|-0.0038082|0.0151691|56.2120382 unknown
InChI: InChI=1S/C12H7ClOS/c13-8-5-6-10-12(7-8)15-11-4-2-1-3-9(11)14-10/h1-7H
charge 0 multiplicity 1
22 atoms
Cl -5.188136 0.811542 -0.001587
S  0.242867 1.917225 0.002159
O  0.443549 -1.33994 0.001641
C  -1.08577 0.653477 0.000788
C  -0.835786 -0.740277 0.000834
C  1.720342 0.824072 0.000521
C  1.644378 -0.587857 0.000616
C  -2.418855 1.120313 -0.000014
C  -1.909814 -1.653684 0.000157
C  2.988584 1.445858 -0.000539
C  2.819629 -1.366418 -0.000271
C  -3.476975 0.191753 -0.00063
C  -3.243969 -1.196484 -0.000535
C  4.169791 0.670701 -0.001384
C  4.083777 -0.74009 -0.001228
H  -2.627598 2.194567 -0.000128
H  -1.679951 -2.722815 0.000205
H  3.050724 2.539969 -0.000666
H  2.715033 -2.455454 -0.00019
H  -4.076841 -1.904213 -0.001007
H  5.144354 1.168839 -0.002156
H  4.991668 -1.351685 -0.001884
