program: Gaussian 09
title: 000139113
version: EM64L-G09RevD.01
frameworkgroup: C1[X(C5H8Br2)]
method: RPBEPBE
basis: SDD
operation: Freq
keyword: #pfreq=noraman
keyword: PBEPBE/SDD
title: #p freq=noraman PBEPBE/SDD
converged: NO YES NO NO
title: Mulliken charges:
elementType: Br Br C C C C C H H H H H H H H
charge: -0.032705 -0.032664 -0.450258 -0.450474 -0.426284 -0.426124 -0.395804 0.343568 0.343595 0.258124 0.267948 0.258258 0.267886 0.237548 0.237385
chargesum: 0.00000
title: Mulliken charges with hydrogens summed into heavy atoms:
elementType: Br Br C C C C C
charge: -0.032705 -0.032664 -0.106690 -0.106879 0.099789 0.100021 0.079129
polarizability: 1.24024490e+02 7.88620560e-03 6.55501348e+01 1.02379473e+01 1.77260938e-03 6.29147864e+01
1716.lowfreq: -25.0635 -13.1502 -0.0002 0.0001 0.0002 11.7515 37.6292 99.1236 161.5058
frequency: 37.3819 99.1064 161.4689 167.9753 269.3484 276.8963 492.7785 560.4398 691.6046 712.8604 781.0931 879.4330 883.6787 898.8745 920.2136 1044.5770 1068.3503 1073.6641 1121.8247 1155.2207 1196.6805 1197.2186 1206.6578 1249.4731 1252.0803 1293.2039 1325.4309 1325.7762 1449.9443 1450.7233 1481.3536 3007.5965 3007.7844 3031.0263 3076.8214 3092.0250 3102.5980 3121.0560 3131.7144
redmass: 2.0786 5.9484 4.4753 14.1480 3.0188 2.7598 4.2468 2.9375 4.8900 2.3666 1.7522 1.5872 3.7352 2.1792 2.7242 1.6542 2.6324 1.4697 1.0485 1.1236 1.8440 1.2745 1.2546 1.3767 1.2257 1.2824 1.4981 1.4792 1.0749 1.0765 1.0866 1.0655 1.0647 1.0630 1.0999 1.0976 1.1021 1.0880 1.0927
irintensity: 0.0617 2.3531 4.5384 0.3776 3.3885 0.7905 76.0456 7.7278 0.5161 11.7550 26.4687 3.8266 3.3104 16.8342 2.4798 16.3993 7.7567 2.0151 0.8177 35.3820 6.0600 8.9366 5.3548 0.3521 0.3326 7.0857 4.8644 4.5056 3.9851 27.3856 12.0395 21.3013 6.9141 29.0443 6.4791 2.2581 28.3364 1.7704 2.7802
temp: 298.150 k
press: 1.00000 atm
elementType: 35 35 6 6 6 6 6 1 1 1 1 1 1 1 1
symmnumber: 1
zpe: 312799.3 jmol-1
zpe.correction: 0.119139 hartree
zpe.thermalcorrener: 0.126912 hartree
zpe.thermalcorrenthalpy: 0.127856 hartree
zpe.thermalcorrgfe: 0.083614 hartree
zpe.sumelectzpe: -221.699037 hartree
zpe.sumelectthermal: -221.691264 hartree
zpe.sumelectthermalent: -221.690319 hartree
zpe.sumelectthermalfe: -221.734562 hartree
dipole: -0.0008 1.6761 0.0000
dipole: 1.6761
quadrupole: -69.9221 -60.1993 -58.8069
quadrupole: -0.0010 0.3163 -0.0009
quadrupole: -6.9460 2.7768 4.1692 -0.0010 0.3163 -0.0009
hfenergy: -221.8181758 hartree
pointgroup: C01 [X(C5H8Br2)]
dipole: -0.0009184 0.6594225 0.000306 debye
dipolederiv: -0.7114855 -0.1247597 -0.1829513 -0.080216 -0.1983487 -0.053039 -0.1764608 -0.0941272 -0.2554132 -0.7122332 0.1239878 -0.1829261 0.0793576 -0.198297 0.0526634 -0.1766685 0.0937092 -0.2551772 0.8018542 0.1832475 0.2950669 0.081561 0.1746811 0.1446115 0.283106 0.2713936 0.2390247 0.8032343 -0.1821971 0.2953258 -0.0804965 0.1747155 -0.1440296 0.2843334 -0.2707034 0.2385602 -0.0505323 -0.0492779 0.0124522 0.0349647 -0.0581402 -0.0523875 -0.0603536 -0.1381559 -0.068018 -0.0495476 0.0491017 0.0128226 -0.0346083 -0.0584828 0.0526236 -0.0604914 0.1381684 -0.0677326 0.1305089 -0.00007 0.0533989 0.0005068 0.0588098 0.0003934 0.0543041 0.0003544 -0.0088416 -0.0408414 -0.0197295 -0.0735345 -0.04784 -0.0207147 0.0291575 -0.0394686 0.0487824 0.0064419 -0.0412252 0.0198494 -0.0733938 0.0477083 -0.0204048 -0.029316 -0.0393869 -0.0490132 0.0062515 0.0218874 -0.0196683 -0.1279769 -0.0508865 0.0256439 -0.0138551 -0.0729824 0.0257209 -0.0306018 -0.0595535 0.044882 0.0971892 0.0350707 0.0716764 -0.0175036 0.0749568 0.0091457 0.0677003 0.0220094 0.0199968 -0.1277777 0.050871 0.0258324 0.013585 -0.0724291 -0.0257532 -0.0315526 -0.060073 -0.0452853 0.0963982 -0.0356742 0.0714488 0.0176529 0.0744624 -0.0091657 0.0683665 -0.0277997 0.1280545 -0.0472535 0.0668382 -0.0231637 0.0411008 -0.036707 0.063474 0.0453909 -0.0262029 -0.1281319 -0.0468399 -0.0671568 -0.0252561 -0.0416573 -0.0362144 -0.06383 0.0456009 unknown
polarizability: 118.1084608|0.0439683|65.5501687|20.7687448|0.0203677|68.8307813 unknown
InChI: InChI=1S/C5H8Br2/c6-4-2-1-3-5(4)7/h4-5H,1-3H2
charge 0 multiplicity 1
15 atoms
Br -2.318325 -0.968889 -0.510879
Br 2.321563 -0.964403 0.509538
C  -0.557354 -0.6254 0.52524
C  0.559676 -0.623118 -0.525872
C  -0.557636 0.792135 1.122227
C  0.556566 0.795426 -1.120842
C  -0.004204 1.72947 0.000365
H  -0.532594 -1.457381 1.24155
H  0.536911 -1.453975 -1.24355
H  0.1239 0.783735 1.993965
H  -1.555182 1.087694 1.483354
H  -0.121675 0.785957 -1.995106
H  1.554356 1.095029 -1.477945
H  -0.800407 2.377854 -0.402243
H  0.786403 2.385066 0.402296
