program: Gaussian 09
title: 000139095
version: EM64L-G09RevD.01
frameworkgroup: C1[X(C16H17N)]
method: RPBEPBE
basis: SDD
operation: Freq
keyword: #pfreq=noraman
keyword: PBEPBE/SDD
title: #p freq=noraman PBEPBE/SDD
converged: YES YES NO NO
title: Mulliken charges:
elementType: N C C C C C C C C C C C C C C C C H H H H H H H H H H H H H H H H H
charge: -0.708790 -0.598498 -0.576445 -0.602088 -0.601958 0.378116 0.575962 0.507867 0.526191 0.308037 -0.581930 -0.389287 -0.470200 -0.400284 -0.406438 -0.421920 -0.388261 0.199310 0.222109 0.217438 0.207983 0.213975 0.208992 0.213539 0.213919 0.212426 0.220519 0.227104 0.225259 0.223322 0.226313 0.220714 0.299405 0.297598
chargesum: 0.00000
title: Mulliken charges with hydrogens summed into heavy atoms:
elementType: N C C C C C C C C C C C C C C C C
charge: -0.111786 -0.177079 -0.151025 -0.179121 -0.174499 0.378116 0.575962 0.507867 0.526191 0.308037 -0.369504 -0.168768 -0.243096 -0.175025 -0.183116 -0.195607 -0.167547
polarizability: 2.04417452e+02 8.64017450e+00 1.16979147e+02 3.07796205e+00 -9.23399622e+00 1.63139801e+02
1716.lowfreq: -19.2756 -10.4641 -0.0007 -0.0005 0.0011 15.7892 63.4285 76.1381 123.2066
frequency: 63.1212 76.0638 123.1763 152.4038 188.8600 233.7424 242.2685 277.4134 297.3873 314.6211 331.1612 337.2070 361.4658 400.1535 421.2579 426.0988 449.8116 486.7755 507.4639 526.5213 556.9272 584.4439 629.6719 660.2827 679.0373 715.8413 720.4682 734.4609 753.6500 779.8305 789.5348 794.0510 803.6298 820.0233 852.9278 866.4517 881.6435 883.4379 913.4992 929.4616 941.0361 944.8723 973.4295 984.8923 1010.9222 1033.9251 1097.5148 1124.2101 1155.3044 1161.2644 1165.2666 1169.8527 1185.6301 1190.4381 1194.0312 1206.1347 1207.8693 1256.2429 1262.2827 1295.2381 1301.3094 1309.4682 1315.8501 1320.3859 1367.4970 1378.7841 1405.2398 1435.2173 1460.2598 1466.5438 1481.9722 1483.5080 1499.5439 1503.2049 1571.8129 1580.0085 1608.6892 1611.8391 1637.3124 2960.4194 2985.1375 2990.7800 3000.1588 3029.6519 3037.9588 3055.9674 3063.7206 3096.1965 3099.9512 3103.2905 3104.8817 3126.8662 3133.6405 3136.2785 3560.7584 3700.2827
redmass: 2.7434 3.0474 4.0254 5.2998 3.4979 2.1681 3.7475 2.4755 2.2763 3.2414 1.6532 1.9908 2.1435 1.5212 2.7342 2.7890 4.0992 3.6047 3.9998 3.9884 4.9022 3.1217 6.4330 3.1427 4.5077 3.8190 3.7759 3.5358 1.6283 1.8269 1.9533 1.4735 1.5965 1.6479 2.1296 2.5315 3.7327 3.7214 1.4061 1.4994 1.8071 1.6293 2.4662 1.6988 2.9541 1.6238 1.4269 1.3961 1.4637 1.4593 1.2091 1.2963 1.1913 2.0815 1.7055 1.3255 2.0464 1.1527 1.2152 1.3412 1.7421 1.4164 1.3195 2.0517 6.5754 6.0363 2.4867 3.5119 1.1085 1.1111 1.1053 1.1577 2.6187 3.0242 6.4544 6.5289 6.1151 4.9057 1.2468 1.0653 1.0584 1.0609 1.0600 1.0968 1.1037 1.1024 1.1049 1.0903 1.0865 1.0870 1.0869 1.0959 1.0962 1.0968 1.0447 1.1034
irintensity: 0.3254 0.0377 0.5367 0.3853 0.5175 1.3495 3.3242 2.4799 24.4438 12.3990 166.1275 63.2073 3.8390 6.7451 3.0136 1.1727 1.3257 1.9281 11.1914 4.9724 3.1034 5.0658 0.0273 23.5969 5.4454 14.0133 7.0273 7.0451 11.6517 2.8889 24.5266 1.0766 8.5279 1.1602 27.8657 10.2398 18.2689 16.2935 4.6035 3.7740 1.0179 3.4241 6.3966 2.2618 0.4196 3.3791 8.9049 0.0955 1.0631 3.2783 2.4312 5.5960 0.4729 2.5307 0.3713 0.9521 1.4830 7.2223 0.8263 0.4914 13.9251 0.2390 0.8484 9.9706 0.1111 6.4645 2.0060 39.2825 7.2985 2.1769 4.5941 8.9022 11.2133 33.8982 1.8535 21.8929 12.3401 18.3359 185.3003 59.7997 23.9687 97.3655 100.9871 2.6789 0.8999 30.6341 34.7205 15.6283 3.3059 1.6084 36.7211 31.6594 25.6214 3.0297 41.8488 16.6852
temp: 298.150 k
press: 1.00000 atm
elementType: 7 6 6 6 6 6 6 6 6 6 6 6 6 6 6 6 6 1 1 1 1 1 1 1 1 1 1 1 1 1 1 1 1 1
symmnumber: 1
zpe: 747971.0 jmol-1
zpe.correction: 0.284887 hartree
zpe.thermalcorrener: 0.298910 hartree
zpe.thermalcorrenthalpy: 0.299854 hartree
zpe.thermalcorrgfe: 0.245757 hartree
zpe.sumelectzpe: -673.411653 hartree
zpe.sumelectthermal: -673.397630 hartree
zpe.sumelectthermalent: -673.396686 hartree
zpe.sumelectthermalfe: -673.450783 hartree
dipole: 1.1939 -0.6536 1.3577
dipole: 1.9225
quadrupole: -88.2131 -112.8367 -88.9455
quadrupole: -0.1995 2.8131 -8.2577
quadrupole: 8.4520 -16.1716 7.7196 -0.1995 2.8131 -8.2577
hfenergy: -673.6965403 hartree
pointgroup: C01 [X(C16H17N1)]
dipole: 0.5007671 0.167461 -0.5415755 debye
polarizability: 199.7603613|-21.5360712|121.1399634|-4.0111055|-7.3605718|163.6360754 unknown
InChI: InChI=1S/C16H17N/c17-16-11-14-6-5-12-1-3-13(4-2-12)7-9-15(16)10-8-14/h1-4,8,10-11H,5-7,9,17H2
charge 0 multiplicity 1
34 atoms
N  2.014646 1.269029 -1.77272
C  2.739095 -0.135497 0.737239
C  2.397709 -1.586913 0.115085
C  -2.606049 1.4967 -0.079754
C  -3.030481 -0.05634 -0.292836
C  1.587653 0.858169 0.612595
C  -1.123301 1.672398 0.222249
C  0.900071 -1.789707 -0.085012
C  -1.839879 -1.006397 -0.299052
C  1.160398 1.341336 -0.665903
C  -0.195828 1.73208 -0.843057
C  0.72685 1.095071 1.71131
C  -0.614465 1.507173 1.536189
C  0.304268 -1.587562 -1.35749
C  0.027292 -1.908945 1.026757
C  -1.051397 -1.1997 -1.46287
C  -1.325082 -1.517438 0.921066
H  3.680357 0.217414 0.267431
H  2.967105 -0.266407 1.811127
H  2.827799 -2.342819 0.799911
H  2.917544 -1.691166 -0.855344
H  -3.224263 1.902186 0.742941
H  -2.878943 2.04907 -0.998632
H  -3.591644 -0.121539 -1.244133
H  -3.729454 -0.328455 0.519966
H  -0.560986 1.921643 -1.861774
H  1.068818 0.809751 2.714531
H  -1.290533 1.546283 2.39801
H  0.935775 -1.58552 -2.253924
H  0.435127 -2.165862 2.012609
H  -1.454681 -0.914712 -2.442881
H  -1.944694 -1.477632 1.825617
H  3.004944 1.081123 -1.650486
H  1.700126 1.595388 -2.682064
