program: Gaussian 09
title: 000139081
version: EM64L-G09RevD.01
frameworkgroup: C1[X(C9H12O)]
method: RPBEPBE
basis: SDD
operation: Freq
keyword: #pfreq=noraman
keyword: PBEPBE/SDD
title: #p freq=noraman PBEPBE/SDD
converged: YES YES NO NO
title: Mulliken charges:
elementType: O C C C C C C C C C H H H H H H H H H H H H
charge: -0.227783 -0.201711 -0.159969 -0.454347 -0.435989 -0.432907 -0.463704 0.131190 -0.140742 -0.303911 0.240450 0.209007 0.217006 0.235043 0.229335 0.216074 0.218103 0.213815 0.215086 0.235093 0.218049 0.242812
chargesum: 0.00000
title: Mulliken charges with hydrogens summed into heavy atoms:
elementType: O C C C C C C C C C
charge: -0.227783 0.038739 0.049038 -0.002298 0.009420 -0.000990 -0.013524 0.131190 0.077307 -0.061099
polarizability: 1.09133923e+02 4.09591470e+00 8.92027974e+01 -1.74648294e-01 2.14174199e-01 7.49125428e+01
1716.lowfreq: -7.9416 -0.0007 -0.0006 -0.0005 8.1043 23.6564 67.6685 160.6523 207.1852
frequency: 67.2621 160.6305 207.1821 253.4142 308.0060 348.7369 382.6154 427.3404 502.8417 524.4895 665.3367 687.6941 752.8779 766.9008 772.0945 830.9121 842.0803 870.5097 895.8418 904.8418 946.5867 954.1203 1003.1959 1057.5072 1069.7667 1091.6526 1099.8914 1156.7154 1162.1357 1185.3969 1207.6271 1235.5023 1244.2345 1269.7306 1284.9885 1302.2643 1323.2089 1324.2841 1337.9284 1354.8937 1359.5191 1389.3774 1463.4109 1467.6752 1473.8172 1486.4435 1570.3610 1631.0199 2977.1209 2981.1468 2991.8682 2996.1344 3013.0355 3027.6579 3036.4568 3038.0896 3058.0617 3062.8178 3096.6630 3135.7944
redmass: 3.2577 2.3433 1.9104 3.0288 2.5261 2.9255 4.5871 4.7773 4.6500 3.5692 4.6266 2.4613 1.6310 2.5512 2.1610 1.9542 3.0492 2.5696 2.4661 2.4958 1.8301 2.6100 1.3364 1.9646 2.2070 1.8332 2.5957 1.4749 1.1236 1.3349 1.1012 1.2159 1.1865 1.5608 1.3985 1.5629 1.3698 1.4144 1.4903 1.3623 1.4259 1.7965 1.0745 1.0793 1.0861 1.0942 8.2760 6.5984 1.0625 1.0611 1.0663 1.0631 1.0823 1.0877 1.1002 1.0969 1.1027 1.1030 1.0869 1.0967
irintensity: 3.3735 0.9695 0.1674 0.6296 0.3586 2.1511 3.8022 8.8715 1.5639 3.1909 0.9644 5.1120 9.5356 5.3305 5.8965 26.2940 7.2591 6.1870 9.3651 0.1708 1.2001 0.9531 1.1436 1.2923 7.0007 7.6845 0.7678 31.4771 2.6548 1.8211 0.4042 6.4533 5.4280 0.2151 7.8961 3.7369 3.0048 2.9992 1.2848 2.3122 3.6703 12.0996 1.6019 8.8714 14.7510 6.6653 157.4929 52.5007 23.0056 13.1621 30.9776 56.9247 82.5788 19.9804 11.6739 13.9424 40.9995 52.5616 15.2269 22.3623
temp: 298.150 k
press: 1.00000 atm
elementType: 8 6 6 6 6 6 6 6 6 6 1 1 1 1 1 1 1 1 1 1 1 1
symmnumber: 1
zpe: 496687.8 jmol-1
zpe.correction: 0.189178 hartree
zpe.thermalcorrener: 0.197553 hartree
zpe.thermalcorrenthalpy: 0.198497 hartree
zpe.thermalcorrgfe: 0.156106 hartree
zpe.sumelectzpe: -424.601045 hartree
zpe.sumelectthermal: -424.592671 hartree
zpe.sumelectthermalent: -424.591726 hartree
zpe.sumelectthermalfe: -424.634117 hartree
dipole: 4.5104 0.3865 0.1909
dipole: 4.5309
quadrupole: -71.0286 -55.1107 -59.3099
quadrupole: -0.7991 -0.7993 0.0057
quadrupole: -9.2122 6.7057 2.5065 -0.7991 -0.7993 0.0057
hfenergy: -424.7902232 hartree
pointgroup: C01[X(C9H12O1)]
dipole: -1.7709656 -0.1305864 0.1558545 debye
dipolederiv: -1.0691931 -0.0569912 0.0738359 -0.1112417 -0.5233628 0.0015068 0.0718656 -0.0032653 -0.3106477 -0.1838561 0.1685612 -0.0125559 0.1680226 -0.0551233 0.0050362 0.0023561 0.0094894 0.0451831 0.1523932 0.076217 0.0209338 0.2350862 -0.0377209 -0.0219905 0.0410955 0.0137562 0.0313848 0.0829352 -0.0384447 0.0210647 0.0208414 0.0494981 -0.0197624 0.0074702 0.0334704 0.0660785 0.1330136 -0.0480669 -0.0181806 0.0178183 0.080363 0.0085504 0.0148121 -0.0490241 0.0747074 0.0138399 -0.0138682 0.0152959 -0.0782047 0.1109685 -0.026202 -0.1229915 -0.0266332 0.1018285 0.0013061 -0.0199531 -0.0158631 -0.0811522 0.0675156 0.0258374 0.0690914 0.0157654 0.0854743 1.1483458 0.0329973 -0.1207592 0.2332873 0.8710204 -0.0097617 -0.1438352 0.0160212 0.0507676 0.3562742 0.0131818 0.003625 -0.163004 0.2231041 -0.0257797 0.0218507 -0.0592106 -0.1870935 -0.3324165 -0.1962255 0.0299979 -0.3786942 -0.2716636 0.0056636 0.028319 0.0005201 -0.1670942 -0.0361317 -0.1030081 -0.0052694 -0.0710467 -0.0690173 -0.0143416 0.0012899 -0.0205713 0.039596 -0.1290543 -0.1083863 -0.0168973 -0.1206241 -0.0539985 -0.0077036 -0.0320607 -0.0072591 0.0366937 0.0335849 0.0639861 0.0358024 0.0307859 -0.138002 -0.1023996 0.0367975 -0.0634299 0.0447192 -0.0156395 -0.0014704 -0.0932763 0.0306156 0.0466181 0.0942352 -0.0696692 0.0478691 -0.0752759 0.0000918 -0.064363 0.1063738 -0.013466 0.0506209 0.0210915 0.068049 0.0494777 -0.1054597 -0.0206049 0.126197 -0.0165465 0.069642 -0.1243095 -0.0070042 -0.0101486 -0.0323186 0.0622864 0.0406761 -0.0276508 0.03814 -0.0805903 0.0022939 0.1089411 0.0715695 0.0769186 -0.1203824 -0.1100066 0.0745328 -0.0181577 0.1603742 -0.038641 -0.0130913 -0.0255402 0.0075971 0.0557582 -0.1458745 0.0468441 -0.0946988 0.1038414 0.0174509 0.0497491 -0.0731116 0.0301686 0.0439437 0.0505523 0.0257784 0.0777723 -0.0197554 -0.0261337 -0.1102344 0.0351481 -0.084297 -0.0805634 0.0413668 -0.0482054 -0.0038216 -0.0113113 -0.1352712 0.0245744 -0.0085619 0.0208965 0.1502329 -0.0116027 0.0983377 -0.0068156 0.0587755 -0.0462097 0.0130851 0.0162043 0.0240589 0.1578625 unknown
polarizability: 109.1545201|3.8571366|89.0765998|-1.4432639|-0.9885085|75.0181429 unknown
InChI: InChI=1S/C9H12O/c10-9-6-3-7-1-4-8(9)5-2-7/h3,6-8H,1-2,4-5H2
charge 0 multiplicity 1
22 atoms
O  2.737862 0.118633 -0.213345
C  0.536805 1.134573 0.088686
C  -1.530826 -0.741112 -0.090706
C  -0.351298 1.031179 1.369982
C  -0.3654 1.312061 -1.169555
C  -1.647375 0.198163 1.149718
C  -1.365019 0.135645 -1.37585
C  1.490572 -0.061029 -0.045938
C  -0.394939 -1.738644 0.05838
C  0.938628 -1.434585 0.059919
H  1.194671 2.019613 0.172012
H  -2.474243 -1.312037 -0.182299
H  -0.624996 2.057352 1.681215
H  0.247671 0.603288 2.194544
H  0.26877 1.445171 -2.064735
H  -0.923403 2.259164 -1.033004
H  -1.881683 -0.392816 2.053992
H  -2.511199 0.869042 0.973411
H  -2.359288 0.537491 -1.650594
H  -1.039102 -0.510433 -2.211109
H  -0.678762 -2.797957 0.138202
H  1.692154 -2.23066 0.121474
