program: Gaussian 09
title: 000011512
version: EM64L-G09RevD.01
frameworkgroup: C1[X(C8H18)]
method: RPBEPBE
basis: SDD
operation: Freq
keyword: #p
keyword: freq=noraman
keyword: PBEPBE/SDD
title: #p freq=noraman PBEPBE/SDD
converged: YES YES NO NO
title: Mulliken charges:
elementType: C C C C C C C C H H H H H H H H H H H H H H H H H H
charge: 0.020027 -0.372570 -0.372906 -0.373975 -0.373964 -0.756055 -0.697676 -0.697828 0.176980 0.186107 0.184872 0.184898 0.186253 0.204155 0.193306 0.193292 0.204453 0.203615 0.219624 0.219907 0.214635 0.208680 0.210427 0.210430 0.214634 0.208676
chargesum: 0.00000
title: Mulliken charges with hydrogens summed into heavy atoms:
elementType: C C C C C C C C
charge: 0.197007 -0.001590 -0.001754 0.023486 0.023782 -0.112909 -0.063934 -0.064087
polarizability: 1.05872812e+02 -7.32805238e-04 8.16403664e+01 -4.00758649e-03 -2.23994775e-01 7.53411841e+01
1716.lowfreq: -0.0005 -0.0002 -0.0001 12.0364 17.4951 17.9869 55.8679 73.2199 80.0785
frequency: 55.8133 73.1072 79.8788 116.0870 118.5583 211.5197 231.3246 231.8650 241.1739 302.0251 320.1104 368.2778 444.3129 511.6145 734.1741 742.9786 821.8224 846.0370 868.9150 869.1105 920.8960 954.1851 974.5189 1032.3870 1034.0276 1056.4613 1078.2932 1097.2211 1150.8505 1161.2012 1175.6440 1223.2202 1246.5428 1260.5959 1289.0097 1290.9675 1296.1670 1323.6953 1336.3554 1350.6969 1359.9290 1383.4975 1388.0138 1388.8267 1454.4082 1465.0748 1471.7480 1473.9887 1476.5484 1476.6495 1477.3618 1484.9954 1485.6185 1490.6732 2937.3425 2943.5802 2949.4655 2968.8186 2969.9072 2970.6440 2971.2315 2971.9724 2991.5355 2998.7052 3026.8198 3030.9060 3063.7706 3067.7924 3068.6823 3070.0791 3070.5608 3076.2071
redmass: 1.4736 2.0560 2.2257 1.8910 2.8797 1.1640 1.2711 1.3481 1.5766 3.6961 2.3617 2.3579 2.1047 2.5256 1.1032 1.1355 2.1059 1.2522 1.6156 1.4867 1.6932 1.7171 1.2378 1.3510 2.9656 2.2691 1.9050 2.3864 2.6810 1.8338 2.0122 1.4006 1.3185 1.2004 1.2762 1.0938 1.1549 1.3951 1.4135 1.6219 1.4646 1.2134 1.2165 1.2164 1.0753 1.0745 1.0668 1.0638 1.0436 1.0435 1.0539 1.0683 1.0765 1.0552 1.0792 1.0591 1.0617 1.0566 1.0539 1.0372 1.0402 1.0437 1.0983 1.0981 1.1018 1.1012 1.0971 1.1007 1.1006 1.0994 1.0992 1.0985
irintensity: 0.0016 0.0015 0.0128 0.0104 0.0428 0.0290 0.0094 0.0110 0.0002 0.0317 0.1198 0.3763 0.4756 0.3768 0.0238 15.7317 0.2056 1.4375 4.2475 4.2206 1.1172 15.4369 0.8931 0.7857 0.1624 2.2880 8.1764 0.5974 2.6791 7.7098 1.0731 0.2565 0.5926 3.0119 0.8201 0.2493 0.8742 1.7690 0.9499 2.8135 0.2314 13.1117 8.7813 19.2062 1.0106 0.6430 0.5555 1.3775 2.3049 22.4088 6.8487 3.1084 4.0952 35.4704 7.7536 0.0554 49.2799 8.8074 116.6251 43.2477 48.2139 1.6740 0.0426 22.4065 0.0252 74.5632 41.0985 1.6508 169.6277 39.4786 72.0747 58.3842
temp: 298.150 k
press: 1.00000 atm
elementType: 6 6 6 6 6 6 6 6 1 1 1 1 1 1 1 1 1 1 1 1 1 1 1 1 1 1
symmnumber: 1
zpe: 633225.3 jmol-1
zpe.correction: 0.241183 hartree
zpe.thermalcorrener: 0.252498 hartree
zpe.thermalcorrenthalpy: 0.253443 hartree
zpe.thermalcorrgfe: 0.204170 hartree
zpe.sumelectzpe: -314.954310 hartree
zpe.sumelectthermal: -314.942994 hartree
zpe.sumelectthermalent: -314.942050 hartree
zpe.sumelectthermalfe: -314.991322 hartree
dipole: 0.0003 -0.0014 -0.0837
dipole: 0.0837
quadrupole: -55.2669 -54.5914 -53.5538
quadrupole: 0.0021 0.0019 0.3717
quadrupole: -0.7962 -0.1207 0.9169 0.0021 0.0019 0.3717
hfenergy: -315.1954923 hartree
pointgroup: C01 [X(C8H18)]
dipole: 0.0001207 -0.0002596 0.0329159 debye
dipolederiv: 0.0528599 -0.0000538 -0.0001328 -0.0001173 0.1247987 0.0243135 0.0002698 0.0008791 0.1692178 -0.05214 0.0069931 0.0001844 -0.0068405 0.0636998 0.0316685 0.0304979 0.036887 0.1470637 -0.0520055 -0.0073391 -0.0002399 0.0067597 0.0634617 0.0313141 -0.0304288 0.036723 0.1474662 0.0089119 0.0109669 0.005497 0.0444874 0.0979764 0.0379414 -0.032854 0.0337903 0.1543452 0.0090358 -0.0109203 -0.0055772 -0.0448786 0.0973778 0.0376416 0.0324714 0.0332338 0.1548552 -0.0131203 0.0000324 0.0000266 0.0004416 -0.1122485 -0.0472242 -0.0001895 -0.0146376 0.0848998 -0.0541799 0.0555701 -0.0161273 0.0320613 0.0587025 0.0177893 0.0110197 0.0158646 0.0854597 -0.0538397 -0.0559843 0.0158272 -0.0323448 0.0581095 0.0176511 -0.01119 0.0157224 0.0857803 0.0385377 0.00004 0.0001694 0.0000714 0.0094857 -0.0110685 0.0000963 0.0027072 -0.2152953 0.0280683 0.001613 0.0105001 -0.0087188 0.0666503 -0.0050926 -0.0074574 0.0345052 -0.1937642 0.0401578 -0.0165661 -0.0025664 -0.0141878 -0.1973566 -0.0540562 -0.0003716 -0.0760629 0.0444566 0.0399408 0.0169088 0.0029215 0.0145632 -0.1968145 -0.055018 0.0007452 -0.0769073 0.0439944 0.0281365 -0.0016179 -0.0110007 0.0085831 0.0663852 -0.004139 0.0069016 0.0355668 -0.193596 0.0489132 -0.0152004 -0.0027746 -0.033063 -0.1773228 -0.0578242 -0.0054181 -0.0810909 0.0426748 0.0273736 0.0146831 -0.0495388 0.0056879 0.0618874 0.0292973 -0.0060362 0.0500474 -0.1980156 0.0275486 -0.0150969 0.0491471 -0.005744 0.0611739 0.0314792 0.0058405 0.0520874 -0.1973953 0.0485445 0.015873 0.002926 0.0336771 -0.1759203 -0.0594564 0.0057229 -0.0826579 0.0414993 0.0934717 0.0003959 0.0009739 0.0000047 0.0644675 0.0455792 0.0011256 -0.0366303 -0.1738379 -0.0920627 -0.1633636 0.0541427 -0.1404988 0.0158612 0.0212408 0.058897 0.0293998 0.0569558 -0.0917062 0.1627168 -0.0551654 0.1399853 0.0161784 0.0215712 -0.0599787 0.0299476 0.0560516 -0.1960749 -0.0495615 0.0727824 -0.0846628 0.0510104 0.0418094 0.0960208 0.0360057 0.0619527 0.0735639 -0.047883 -0.0298303 0.0255492 -0.1587969 -0.0797815 -0.0166913 -0.0927997 0.050621 0.0815304 0.0122522 0.0046994 0.025924 0.0741381 0.0111132 -0.0624187 0.0370084 -0.1838179 0.0816813 -0.0122057 -0.0049481 -0.0264018 0.0736233 0.0130446 0.0620399 0.0391617 -0.1834704 -0.1966188 0.0493382 -0.0723379 0.0845513 0.0508746 0.0414307 -0.0954132 0.035578 0.062624 0.0734723 0.0484089 0.0304413 -0.0248891 -0.157403 -0.0812246 0.0167989 -0.0943286 0.0492745 unknown
polarizability: 105.872771|0.0318249|81.6476142|0.0016649|-0.0687722|75.3339777 unknown
InChI: InChI=1S/C8H18/c1-4-6-8(3)7-5-2/h8H,4-7H2,1-3H3
charge 0 multiplicity 1
26 atoms
C  0.001312 -0.347019 0.212562
C  -1.272694 0.426668 -0.226731
C  1.272959 0.430882 -0.226201
C  -2.605526 -0.135252 0.320041
C  2.60801 -0.130686 0.315612
C  0.004023 -1.798433 -0.327165
C  -3.818355 0.742617 -0.059593
C  3.817693 0.754052 -0.0580
H  0.001175 -0.392594 1.324682
H  -1.315058 0.45267 -1.337048
H  -1.176752 1.482887 0.103519
H  1.17561 1.485623 0.108302
H  1.313018 0.461299 -1.336492
H  -2.768805 -1.162345 -0.060811
H  -2.539196 -0.217763 1.424676
H  2.542728 -0.222029 1.419629
H  2.774359 -1.154229 -0.07338
H  0.007962 -1.798259 -1.435182
H  -0.886351 -2.359584 0.008304
H  0.892735 -2.358417 0.014602
H  -4.762229 0.32432 0.336279
H  -3.707737 1.767846 0.341787
H  -3.919307 0.823579 -1.158601
H  3.917873 0.843633 -1.15641
H  4.763169 0.335987 0.334279
H  3.703782 1.775849 0.351141
