program: Gaussian 09
title: 000139061
version: EM64L-G09RevD.01
frameworkgroup: C1[X(C9H16O)]
method: RPBEPBE
basis: SDD
operation: Freq
keyword: #pfreq=noraman
keyword: PBEPBE/SDD
title: #p freq=noraman PBEPBE/SDD
converged: NO NO NO NO
title: Mulliken charges:
elementType: O C C C C C C C C C H H H H H H H H H H H H H H H H
charge: -0.295644 0.363237 -0.090078 -0.499413 -0.496617 -0.499072 -0.441316 -0.437536 -0.441093 -0.541515 0.201953 0.208094 0.224299 0.223795 0.223764 0.224417 0.207642 0.207620 0.201566 0.204713 0.204705 0.201580 0.207590 0.230626 0.203550 0.203134
chargesum: 0.00000
title: Mulliken charges with hydrogens summed into heavy atoms:
elementType: O C C C C C C C C C
charge: -0.295644 0.363237 0.111875 -0.067020 -0.049057 -0.067014 -0.032130 -0.028118 -0.031923 0.095795
polarizability: 1.05311509e+02 -1.19535396e+00 8.67551328e+01 -1.06882852e-03 1.24513372e-03 8.62018364e+01
1716.lowfreq: -66.5877 -25.0623 -17.3991 -0.0005 0.0004 0.0007 12.0504 65.8958 196.4938
frequency: -66.5343 65.8587 196.4927 198.3807 245.2655 266.6953 319.2741 346.5839 405.6046 419.6551 486.0632 491.7535 526.6278 681.1347 778.8812 789.4043 814.8958 819.1390 864.7005 907.1686 911.2132 915.7596 979.4174 982.4095 988.6783 1035.9305 1060.9058 1065.2615 1073.8921 1105.5892 1114.7055 1116.8097 1118.3226 1163.1037 1200.6932 1204.6013 1221.3056 1260.2482 1261.3144 1276.8360 1287.2733 1307.9711 1310.6005 1318.4250 1331.0411 1339.2256 1340.0308 1438.2791 1460.6002 1460.7124 1466.1002 1474.3930 1474.8989 1477.0699 1481.0015 1502.1797 2934.6773 2974.1117 2974.2541 2978.0733 2990.7450 2992.0832 3001.7751 3009.5946 3015.4703 3022.8605 3027.0945 3030.4470 3049.8120 3058.0313 3066.9874 3086.6532
redmass: 1.7585 1.9719 2.3360 1.3057 1.8547 1.9254 2.6192 2.4927 2.5649 3.3664 3.7253 3.8600 4.5808 4.9914 1.1773 2.9521 1.3960 1.4162 5.0114 1.7692 1.8243 2.2595 6.2726 2.1175 2.1747 2.3408 2.2140 6.2205 2.0668 1.0960 1.3036 1.4388 1.3271 1.3629 1.2803 1.3328 1.1357 1.3021 1.4276 1.5269 1.4773 1.7681 1.7605 1.6535 1.5533 1.4629 1.4979 1.1338 1.0735 1.0759 1.0599 1.0819 1.0764 1.0867 1.0620 1.0942 1.0337 1.0610 1.0587 1.0597 1.0625 1.0640 1.0645 1.1002 1.0774 1.1045 1.1030 1.1032 1.1045 1.1033 1.1032 1.0973
irintensity: 0.2368 4.4364 0.9932 0.6311 4.0790 0.8006 3.4892 0.5532 3.1936 0.5274 0.0454 0.0754 7.7582 1.9728 0.0292 0.2571 1.6919 2.7566 6.7212 3.8797 3.2748 5.6268 8.5851 4.8899 3.7436 1.5911 1.3939 111.8185 1.7765 0.0047 1.0644 4.0241 0.3475 6.7635 0.0129 0.7904 0.2843 7.4212 9.3390 7.5722 3.4231 9.1204 3.4781 7.2012 13.7804 0.0540 2.5319 1.6790 0.3606 0.3967 15.1126 13.2836 3.9266 7.1443 20.7575 0.2012 64.2557 42.9818 10.7013 16.2238 56.1912 94.4173 85.8012 90.9214 50.8909 0.3507 3.0924 10.7103 9.8055 93.3593 77.3780 36.5915
temp: 298.150 k
press: 1.00000 atm
elementType: 8 6 6 6 6 6 6 6 6 6 1 1 1 1 1 1 1 1 1 1 1 1 1 1 1 1
symmnumber: 1
zpe: 612267.0 jmol-1
zpe.correction: 0.233200 hartree
zpe.thermalcorrener: 0.242157 hartree
zpe.thermalcorrenthalpy: 0.243101 hartree
zpe.thermalcorrgfe: 0.199698 hartree
zpe.sumelectzpe: -426.950584 hartree
zpe.sumelectthermal: -426.941628 hartree
zpe.sumelectthermalent: -426.940683 hartree
zpe.sumelectthermalfe: -426.984086 hartree
dipole: -0.6584 -1.5423 0.0007
dipole: 1.6770
quadrupole: -60.9079 -63.2070 -61.7887
quadrupole: -4.1290 0.0046 0.0028
quadrupole: 1.0600 -1.2392 0.1792 -4.1290 0.0046 0.0028
hfenergy: -427.1837846 hartree
pointgroup: C01 [X(C9H16O1)]
dipole: -0.265061 0.6041888 -0.0001422 debye
dipolederiv: -1.1082348 -0.113386 -0.0011146 -0.0933955 -0.4139786 -0.0002881 -0.0002119 -0.000037 -0.47758 0.8344157 0.0030303 0.0008197 -0.1766331 0.2269255 0.0000594 0.0008062 0.0002221 0.4205152 0.1335001 -0.0103858 0.000058 -0.0036386 0.0945282 0.0000323 0.000011 -0.0000145 0.0962544 -0.0896374 0.0371073 0.0364573 0.1190593 0.0426912 -0.0941703 0.0847453 -0.0962436 -0.0475249 -0.0669474 -0.059411 0.0001838 -0.080769 -0.000129 0.0006077 0.0005959 0.0005769 0.1060927 -0.0898398 0.0366753 -0.036833 0.1183504 0.0443499 0.093331 -0.0858468 0.0955466 -0.0494193 0.0959136 -0.0321029 -0.060789 -0.0246387 0.1159824 -0.0228658 -0.0381381 -0.0279331 0.0569323 0.1077329 0.052204 -0.0003045 0.0370051 0.004659 0.0004963 -0.0001802 0.0005563 0.1243877 0.095932 -0.0313737 0.0610387 -0.0243038 0.1165081 0.0223404 0.0381491 0.0273127 0.0561163 0.481381 0.1137214 0.0008937 0.3258964 0.324683 0.0007841 0.0006645 0.0006326 0.3465639 -0.2440697 0.0529824 0.0000068 0.0534624 0.0292165 0.0000143 0.0000014 -0.0000183 0.0378294 -0.0323774 -0.1022457 -0.0333319 -0.1345788 -0.1122807 -0.0267701 0.0073879 0.0019526 0.0623236 0.0212358 0.0266093 -0.0559557 0.052431 0.0163998 0.1156408 -0.0630813 0.0692614 -0.1021722 0.0326968 0.0493542 -0.0381322 0.0323721 -0.0002135 0.0852518 -0.060347 0.1333064 -0.0752579 0.0329362 0.0496749 0.037574 0.0329597 -0.0024842 -0.0860097 0.0598762 -0.1340911 -0.0729745 0.0215879 0.0270301 0.0551143 0.0527661 0.0145258 -0.1171746 0.0619838 -0.0705776 -0.1003134 -0.0324026 -0.1022038 0.0347889 -0.1347943 -0.1120203 0.0289263 -0.0055965 -0.0000881 0.0622747 -0.0335307 -0.0103013 0.0878213 -0.0553894 0.0491808 0.1033108 0.0969208 0.0483997 -0.133623 0.0046915 0.0302698 0.0047684 0.0763631 -0.2015321 -0.056011 -0.0168819 0.0039182 0.0691331 -0.0333942 -0.0478066 -0.0686116 -0.0379409 0.002077 -0.0802039 -0.1302507 -0.1252699 -0.0898346 -0.0331722 -0.0471147 0.0689401 -0.0366517 0.0039521 0.0793892 0.1305245 0.1244872 -0.0919238 0.004791 0.0300729 -0.0048835 0.0765891 -0.2011102 0.0583378 0.0163067 -0.001497 0.0686001 -0.0339436 -0.011211 -0.0880686 -0.0564806 0.0477758 -0.104852 -0.0965972 -0.0499663 -0.1318619 -0.167596 0.0625465 0.0009723 0.1069352 0.0452933 -0.0006707 0.001315 -0.0007268 0.1024637 0.048884 -0.0025807 0.0328868 -0.1130897 -0.0665504 -0.1249879 -0.0263479 -0.1336113 -0.1195081 0.0494472 -0.0011551 -0.0342994 -0.1118857 -0.0684494 0.1254819 0.0241913 0.1339021 -0.1174933 unknown
polarizability: 105.2859357|1.3794025|86.7807048|0.0027769|0.0014886|86.2018373 unknown
InChI: InChI=1S/C9H16O/c1-10-9-5-2-8(3-6-9)4-7-9/h8H,2-7H2,1H3
charge 0 multiplicity 1
26 atoms
O  2.045881 -0.632046 0.000323
C  0.630831 -0.205787 -0.000061
C  -1.937129 0.291691 -0.0001
C  0.258669 0.61652 1.262074
C  -0.159445 -1.532739 0.007448
C  0.256165 0.603734 -1.269655
C  -1.282479 0.913528 1.261616
C  -1.697984 -1.240944 0.006819
C  -1.284787 0.901622 -1.268792
C  3.052304 0.422745 0.000018
H  -3.025157 0.500202 -0.000074
H  0.83209 1.562925 1.278163
H  0.555935 0.040139 2.158433
H  0.143825 -2.113371 0.897759
H  0.142801 -2.122678 -0.877073
H  0.551112 0.017871 -2.16057
H  0.830072 1.549581 -1.296758
H  -1.756069 0.495308 2.170282
H  -1.469209 2.004509 1.27789
H  -2.180627 -1.695997 -0.879195
H  -2.179741 -1.687888 0.897434
H  -1.470997 1.992501 -1.294674
H  -1.760412 0.475305 -2.172613
H  4.022513 -0.100994 -0.005603
H  2.998857 1.063653 0.904718
H  2.99208 1.070312 -0.899509
