program: Gaussian 09
title: 000139060
version: EM64L-G09RevD.01
frameworkgroup: C1[X(C8H13Br)]
method: RPBEPBE
basis: SDD
operation: Freq
keyword: #pfreq=noraman
keyword: PBEPBE/SDD
title: #p freq=noraman PBEPBE/SDD
converged: NO YES NO NO
title: Mulliken charges:
elementType: Br C C C C C C C C H H H H H H H H H H H H H
charge: -0.069079 -0.211031 -0.115436 -0.398070 -0.398012 -0.398375 -0.435043 -0.435089 -0.434416 0.214537 0.235284 0.235095 0.235116 0.235234 0.235313 0.235250 0.211235 0.211713 0.211654 0.211292 0.211411 0.211417
chargesum: 0.00000
title: Mulliken charges with hydrogens summed into heavy atoms:
elementType: Br C C C C C C C C
charge: -0.069079 -0.211031 0.099101 0.072309 0.072338 0.072189 -0.012095 -0.012143 -0.011588
polarizability: 1.25191109e+02 8.85100105e-04 8.12155892e+01 -5.05900310e-04 2.03720086e-04 8.12065660e+01
1716.lowfreq: -5.0120 -0.0007 -0.0006 -0.0006 14.9575 23.4405 58.9455 182.3110 186.2010
frequency: 57.2837 182.3058 186.1802 246.0801 278.9435 289.1976 372.6048 377.0889 488.9137 490.8043 644.2424 783.6348 788.3347 805.4373 818.1607 823.9376 898.4815 899.5416 914.4479 943.3622 988.7972 990.0598 1026.7380 1066.3408 1067.0845 1114.8671 1116.1461 1117.9323 1199.5707 1200.4279 1216.2670 1257.0984 1258.2944 1284.0614 1284.1823 1299.9778 1310.2170 1311.8382 1326.9592 1338.1535 1338.7079 1459.4357 1462.3292 1473.5541 1476.5007 1476.9481 1500.5873 2982.9407 2986.1634 2986.8902 3007.1987 3009.8129 3010.3661 3021.5482 3036.7506 3041.7776 3042.6440 3068.1591 3077.2835 3078.1355
redmass: 1.7592 3.2483 3.3922 10.5304 1.8600 1.8457 2.2434 2.2723 3.6978 3.6370 7.0670 1.1781 2.9346 4.9450 1.4157 1.4197 2.4421 2.4638 1.4474 6.3892 2.1536 2.1434 2.6323 2.2861 2.2692 1.4576 1.4633 1.0312 1.2571 1.2537 1.1141 1.2975 1.2993 1.4340 1.4234 1.4079 1.8222 1.8076 1.4893 1.4624 1.4549 1.0781 1.0778 1.0887 1.0838 1.0885 1.0942 1.0639 1.0590 1.0591 1.0699 1.0607 1.0609 1.0737 1.1052 1.1040 1.1041 1.1051 1.1042 1.1042
irintensity: 0.0007 0.3058 0.2983 11.7214 0.0010 0.0051 0.0051 0.0013 0.5805 0.5838 16.8888 0.0222 0.3343 42.7147 2.5054 2.2900 3.8547 3.7192 0.0036 49.8110 0.3395 0.3105 5.1803 0.6921 0.6265 0.3272 0.3031 0.0028 0.7387 0.7053 0.0051 12.3877 12.2599 1.8333 1.5284 32.4534 0.3903 0.4439 1.5841 0.8505 0.9196 0.3200 0.0275 16.9574 9.8777 15.3110 0.8525 19.1944 25.2875 24.7469 87.8549 56.0006 57.2767 36.7401 0.1407 14.9751 14.4530 0.1476 62.2635 62.5222
temp: 298.150 k
press: 1.00000 atm
elementType: 35 6 6 6 6 6 6 6 6 1 1 1 1 1 1 1 1 1 1 1 1 1
symmnumber: 1
zpe: 506030.7 jmol-1
zpe.correction: 0.192737 hartree
zpe.thermalcorrener: 0.201227 hartree
zpe.thermalcorrenthalpy: 0.202172 hartree
zpe.thermalcorrgfe: 0.158455 hartree
zpe.sumelectzpe: -325.402310 hartree
zpe.sumelectthermal: -325.393819 hartree
zpe.sumelectthermalent: -325.392875 hartree
zpe.sumelectthermalfe: -325.436592 hartree
dipole: 3.3656 0.0004 -0.0003
dipole: 3.3656
quadrupole: -68.3352 -63.7928 -63.8027
quadrupole: 0.0020 -0.0005 0.0005
quadrupole: -3.0250 1.5175 1.5075 0.0020 -0.0005 0.0005
hfenergy: -325.5950465 hartree
pointgroup: C01 [X(C8H13Br1)]
dipole: -1.3241288 -0.0001127 -0.0001684 debye
dipolederiv: -0.8998797 -0.0000817 -0.0000156 0.0000622 -0.2085013 0.000009 -0.0000141 -0.0000145 -0.2084986 1.2450483 0.000124 -0.0000014 -0.0003309 0.1806259 0.0001075 -0.0000836 -0.000234 0.1804478 0.1697312 0.0002972 0.0000248 0.0003289 0.0953962 0.0000896 0.0000877 -0.0001822 0.0951843 -0.2022086 0.0596289 -0.1007291 -0.0061066 0.0631354 0.0524718 0.0105652 0.0526625 0.0073234 -0.2020473 0.0570732 0.1022802 -0.0057365 0.0661849 -0.0507535 -0.0107578 -0.0508332 0.0042027 -0.202219 -0.1170791 -0.0016943 0.0125013 -0.0242469 -0.0017965 0.0002043 -0.0017009 0.0946518 0.1373343 -0.0357771 0.0608319 0.0128629 0.0912483 0.0545977 -0.0216746 0.0547765 0.0333352 0.1373344 -0.0344072 -0.0617277 0.0121648 0.0944749 -0.0529147 0.022058 -0.0527543 0.030068 0.1376193 0.0704917 0.0010718 -0.0255584 0.000591 -0.0018846 -0.0003469 -0.0016503 0.1238825 -0.2369288 -0.0001554 -0.0000247 -0.0002283 0.0404225 -0.0000066 -0.0000018 0.0000121 0.0404632 0.0195209 0.0144391 0.0666932 0.0497427 0.0403356 -0.1030345 0.0551985 -0.0577155 -0.0822022 0.0194733 -0.065452 0.0189031 -0.0724221 -0.121759 0.0296312 -0.0176867 -0.0159056 0.0796289 0.0195275 -0.0649334 -0.0207503 -0.0728624 -0.1211369 -0.0353368 0.0156394 0.0102262 0.0792242 0.0194699 0.0163481 -0.0661924 0.0513857 0.0356029 0.1063419 -0.0537291 0.0610816 -0.0776086 0.0194297 0.0504975 -0.0459066 0.0229421 0.0179923 0.0705615 -0.0708507 0.1159499 -0.0599768 0.0193744 0.0491647 0.0473105 0.0209611 0.0233709 -0.0681706 0.0715113 -0.1135933 -0.0653267 -0.0331911 0.0675191 -0.0193751 0.1046239 -0.1629454 0.0453033 0.015743 -0.0056406 0.0711228 -0.0336295 -0.0148298 -0.0692765 -0.06295 0.0363493 -0.111281 -0.0849546 -0.0608245 -0.1274975 -0.0335305 -0.0169504 0.0687397 -0.0655358 0.0309673 0.1160471 0.0829808 0.0655423 -0.1222683 -0.0333195 0.0670759 0.0213968 0.1050484 -0.1613468 -0.0521776 -0.0127019 -0.0013309 0.0699014 -0.0334517 -0.0507799 -0.0490305 -0.0389823 -0.005026 -0.0863961 -0.0983502 -0.1370653 -0.0863195 -0.0334575 -0.0522134 0.047472 -0.0419107 -0.0117352 0.0885921 0.0971637 0.139194 -0.079738 unknown
polarizability: 125.1911093|-0.0009625|81.2155627|0.0024598|-0.0005293|81.2065926 unknown
InChI: InChI=1S/C8H13Br/c9-8-4-1-7(2-5-8)3-6-8/h7H,1-6H2
charge 0 multiplicity 1
22 atoms
Br 2.972734 -0.000089 0.000171
C  0.903719 -0.000691 0.000026
C  -1.677192 -0.000977 -0.000086
C  0.420629 0.75039 -1.258011
C  0.420504 0.714258 1.278883
C  0.420532 -1.46532 -0.020839
C  -1.153724 0.749127 -1.254176
C  -1.153788 0.71251 1.275184
C  -1.152718 -1.461264 -0.021011
H  -2.784515 -0.001488 -0.00011
H  0.81928 0.25323 -2.160064
H  0.819598 1.780238 -1.247788
H  0.819314 1.743991 1.297948
H  0.819314 0.191626 2.166405
H  0.819669 -1.997641 0.860813
H  0.819783 -1.972125 -0.91736
H  -1.536087 1.787171 -1.2546
H  -1.537962 0.261551 -2.169736
H  -1.537677 0.197878 2.176005
H  -1.536694 1.749823 1.306345
H  -1.536215 -1.983124 -0.91788
H  -1.536506 -2.008972 0.86018
