program: Gaussian 09
title: 000139055
version: EM64L-G09RevD.01
frameworkgroup: C1[X(C4F4N2)]
method: RPBEPBE
basis: SDD
operation: Freq
keyword: #p
keyword: freq=noraman
keyword: PBEPBE/SDD
title: #p freq=noraman PBEPBE/SDD
converged: NO NO NO NO
title: Mulliken charges:
elementType: F F F F N N C C C C
charge: -0.120991 -0.120994 -0.138302 -0.138299 -0.029877 -0.029878 0.152759 0.152756 0.136411 0.136413
chargesum: 0.00000
title: Mulliken charges with hydrogens summed into heavy atoms:
polarizability: 7.65037325e+01 5.51529468e-05 6.57925720e+01 -8.36892961e-05 7.50069169e-05 2.42591586e+01
1716.lowfreq: -5.2937 -2.0106 -0.0011 -0.0005 0.0006 13.9352 128.6497 128.9073 247.9607
frequency: 128.6449 128.9065 247.9607 261.3111 273.7968 314.9897 394.8631 452.0330 458.6798 546.0611 593.7257 623.1224 626.6127 687.9133 722.8150 925.6840 1014.5814 1143.6817 1174.8046 1239.8867 1331.9395 1424.3218 1501.7977 1553.4801
redmass: 18.5216 16.8872 18.8153 18.3278 13.2724 17.5092 13.5677 15.9252 16.2885 12.9684 14.0761 15.8392 12.2567 15.3818 12.2895 14.1703 13.7180 13.8307 13.1075 12.6430 12.5738 12.5509 12.1435 12.1722
irintensity: 0.0000 0.0020 0.5546 0.3967 16.3944 1.8715 0.0000 1.9713 0.0786 0.0000 1.5981 7.0136 4.5639 28.2344 0.0000 67.2362 111.3055 2.1347 19.0833 1.6563 341.4278 65.0294 85.5182 51.9147
temp: 298.150 k
press: 1.00000 atm
elementType: 9 9 9 9 7 7 6 6 6 6
symmnumber: 1
zpe: 106297.9 jmol-1
zpe.correction: 0.040487 hartree
zpe.thermalcorrener: 0.048364 hartree
zpe.thermalcorrenthalpy: 0.049308 hartree
zpe.thermalcorrgfe: 0.007414 hartree
zpe.sumelectzpe: -660.491747 hartree
zpe.sumelectthermal: -660.483870 hartree
zpe.sumelectthermalent: -660.482926 hartree
zpe.sumelectthermalfe: -660.524820 hartree
dipole: 0.0000 2.0936 0.0000
dipole: 2.0936
quadrupole: -61.1072 -64.2351 -50.4917
quadrupole: 0.0000 0.0000 0.0000
quadrupole: -2.4959 -5.6238 8.1196 0.0000 0.0000 0.0000
hfenergy: -660.5322337 hartree
pointgroup: C01 [X(C4F4N2)]
dipole: -0.0000655 0.8236959 0.0000109 debye
dipolederiv: -0.3630825 -0.3345184 0.0000014 -0.4105516 -0.7597171 0.000003 0.0000046 0.0000051 -0.0876504 -0.3631858 0.334571 0.0000035 0.4106042 -0.7596129 -0.0000058 0.0000026 -0.0000079 -0.0876524 -1.0322205 0.005874 0.0000071 0.0175833 -0.1625645 -0.0000005 0.0000199 0.0000014 -0.1305859 -1.0322209 -0.0059958 -0.0000055 -0.0177032 -0.1625652 -0.0000001 -0.0000072 0.0000002 -0.1305831 -0.2096739 0.2308075 0.0000045 -0.4076789 -0.0959749 0.0000081 0.0000027 -0.0000023 -0.1895669 -0.2096919 -0.2308243 -0.0000042 0.4076611 -0.0959415 0.0000022 -0.000003 -0.0000004 -0.1895674 0.2489922 0.4480456 0.0000004 0.6374033 0.8700724 -0.0000068 0.0000006 -0.000009 0.1596291 0.2491363 -0.4481302 -0.0000046 -0.6374873 0.8699171 0.0000092 -0.0000078 0.0000127 0.1596267 1.3559798 -0.0399435 -0.0000141 -0.0932973 0.1481866 -0.0000038 -0.0000256 0.0000007 0.2481747 1.3559671 0.040114 0.0000115 0.0934664 0.1482 -0.0000054 0.0000132 -0.0000007 0.2481757 unknown
polarizability: 76.5037325|0.0008144|65.7925721|-0.0000837|0.000075|24.2591586 unknown
InChI: InChI=1S/C4F4N2/c5-1-2(6)4(8)10-9-3(1)7
charge 0 multiplicity 1
10 atoms
F  1.41616 1.952573 0.000014
F  -1.416427 1.952377 0.00004
F  2.716739 -0.548935 -0.000003
F  -2.716661 -0.549311 0.000007
N  0.688363 -1.677043 0.000022
N  -0.688134 -1.677141 0.000022
C  0.700823 0.772256 0.000025
C  -0.700927 0.772155 0.000028
C  1.336616 -0.498323 0.000024
C  -1.33655 -0.498508 0.00002
