program: Gaussian 09
title: 000139052
version: EM64L-G09RevD.01
frameworkgroup: C1[X(C4H8Br2O2S)]
method: RPBEPBE
basis: SDD
operation: Freq
keyword: #p
keyword: freq=noraman
keyword: PBEPBE/SDD
title: #p freq=noraman PBEPBE/SDD
converged: YES YES NO NO
title: Mulliken charges:
elementType: Br Br S O O C C C C H H H H H H H H
charge: 0.021724 0.021765 0.925602 -0.557893 -0.558239 -0.496038 -0.496156 -0.631558 -0.631679 0.289479 0.279296 0.289926 0.279054 0.318886 0.313459 0.319068 0.313305
chargesum: 0.00000
title: Mulliken charges with hydrogens summed into heavy atoms:
elementType: Br Br S O O C C C C
charge: 0.021724 0.021765 0.925602 -0.557893 -0.558239 0.072737 0.072823 0.000786 0.000694
polarizability: 1.91347134e+02 3.93593742e-04 8.95524191e+01 -3.63990750e-01 3.31704144e-02 7.25426195e+01
1716.lowfreq: -15.0957 -4.2755 -0.0021 -0.0014 0.0015 1.5680 16.9161 23.6137 45.9646
frequency: 14.3403 23.5966 45.9633 67.5312 75.0318 120.6216 134.5893 167.0109 211.9783 231.4247 256.9717 334.5886 393.5007 517.1809 539.9265 627.5851 628.9662 774.3155 777.5116 800.5230 877.2407 911.1187 975.3668 1051.2308 1069.4043 1072.6352 1099.2112 1187.5243 1207.2767 1256.9004 1259.6629 1267.3048 1268.9895 1410.3551 1418.6385 1462.3738 1462.8215 3055.7730 3058.0655 3073.9417 3074.3520 3146.7473 3147.7076 3168.5629 3169.5611
redmass: 3.6308 6.6096 4.0037 3.2823 3.2401 22.3856 7.7928 8.2669 4.0997 4.9413 3.6833 9.8450 9.5821 8.7798 6.5391 6.0837 5.1636 1.1826 1.1413 13.5676 2.4059 1.2924 2.0542 4.5152 4.4734 1.0323 1.1334 1.1531 1.1472 1.1741 1.2121 1.1786 1.1998 1.1072 1.1117 1.0971 1.0981 1.0559 1.0565 1.0555 1.0555 1.1115 1.1115 1.1125 1.1125
irintensity: 2.1728 0.1021 0.0731 0.0318 9.5498 0.1865 28.3672 7.8315 0.1274 3.7304 2.0257 21.1359 102.5562 0.0847 29.4283 4.4953 6.7720 8.5332 0.4428 71.1986 63.9067 0.0298 25.6537 47.2440 0.6228 0.0014 18.1672 1.0381 26.0544 2.6159 0.8659 13.7230 1.7792 7.7359 10.0414 2.1970 17.5750 9.4915 0.6400 3.2855 2.5445 0.0038 0.3545 0.3459 0.1845
temp: 298.150 k
press: 1.00000 atm
elementType: 35 35 16 8 8 6 6 6 6 1 1 1 1 1 1 1 1
symmnumber: 1
zpe: 310406.6 jmol-1
zpe.correction: 0.118228 hartree
zpe.thermalcorrener: 0.130817 hartree
zpe.thermalcorrenthalpy: 0.131762 hartree
zpe.thermalcorrgfe: 0.073395 hartree
zpe.sumelectzpe: -731.752827 hartree
zpe.sumelectthermal: -731.740238 hartree
zpe.sumelectthermalent: -731.739293 hartree
zpe.sumelectthermalfe: -731.797660 hartree
dipole: -0.0038 -3.2012 -0.0213
dipole: 3.2013
quadrupole: -89.6999 -87.8525 -87.1339
quadrupole: -0.0084 0.6740 0.0356
quadrupole: -1.4712 0.3763 1.0949 -0.0084 0.6740 0.0356
hfenergy: -731.8710549 hartree
pointgroup: C01 [X(C4H8Br2O2S1)]
dipole: 0.0011456 1.2594808 0.002513 debye
dipolederiv: -0.7472221 0.1434317 0.0018677 0.1816814 -0.1737706 -0.0022127 -0.0088808 -0.0016768 -0.0867248 -0.7465627 -0.1436822 -0.0015842 -0.182337 -0.1740288 0.0010725 -0.0141272 0.000644 -0.0867721 1.4089378 -0.0000641 -0.0015717 -0.0014255 1.2666958 0.0017724 -0.0104737 0.0008911 1.2159133 -0.6856366 -0.0104896 -0.0038762 -0.0217876 -0.58018 -0.0320262 -0.0239589 -0.1716876 -0.6414537 -0.6871662 0.0102864 -0.0035411 0.0225137 -0.5811892 0.031489 -0.0246747 0.171345 -0.639746 -0.0271529 -0.0264898 -0.0127759 -0.1470133 -0.1366893 -0.0119615 0.0109518 -0.0252314 -0.0433978 -0.0276802 0.0264112 -0.0128211 0.1470438 -0.1366499 0.0116414 0.0115574 0.0262516 -0.0435985 0.7299007 -0.3031694 -0.0210742 0.0358312 0.1571639 -0.0037749 0.0353135 -0.0108613 0.0478774 0.7296277 0.3031395 -0.017316 -0.0346155 0.1576603 0.0048243 0.0409744 0.0137132 0.047725 -0.0063576 0.0326461 -0.0096659 0.0001512 0.0358109 -0.0462964 -0.0646291 -0.0378544 0.0093999 -0.0043561 0.0230831 0.0238015 -0.031988 0.0085387 0.0498548 0.0600549 0.0505861 0.0262328 -0.0057344 -0.0330344 -0.0093307 -0.0010173 0.0362808 0.0460933 -0.064714 0.0371152 0.0091493 -0.0051267 -0.0224906 0.0239939 0.0329602 0.0081814 -0.0497999 0.059794 -0.0510215 0.0268208 0.0275835 0.0921459 0.0453591 0.0273843 0.0441877 -0.0507783 -0.0334554 -0.0408165 0.0321333 0.0096937 0.0936192 -0.0233822 0.020978 0.0119995 0.0573344 0.0301515 0.0575249 0.0470334 0.0279884 -0.0923035 0.0453025 -0.0277475 0.0445411 0.0504295 -0.0336085 0.0395068 0.0323586 0.0092638 -0.0930395 -0.0233855 -0.0206121 0.0114477 -0.0576617 0.0297248 -0.0584282 0.0470491 unknown
polarizability: 191.3446888|0.0279236|89.5517266|-0.6497383|0.1138838|72.5457576 unknown
InChI: InChI=1S/C4H8Br2O2S/c5-1-3-9(7,8)4-2-6/h1-4H2
charge 0 multiplicity 1
17 atoms
Br -4.415587 1.042626 0.053571
Br 4.413981 1.045261 -0.035999
S  -0.000367 -0.540866 -0.00599
O  -0.131301 -1.341258 -1.427069
O  0.129673 -1.34861 1.411158
C  -1.559446 0.668367 0.130787
C  1.558912 0.668227 -0.13574
C  -2.800914 -0.185955 -0.024122
C  2.799885 -0.184602 0.03134
H  -1.449978 1.129431 1.123908
H  -1.419436 1.391108 -0.688085
H  1.456155 1.125743 -1.13121
H  1.413043 1.39414 0.67933
H  -2.851556 -0.687056 -1.001383
H  -2.933906 -0.902306 0.799056
H  2.84279 -0.68357 1.01004
H  2.940353 -0.902779 -0.788988
