program: Gaussian 09
title: 000139048
version: EM64L-G09RevD.01
frameworkgroup: C1[X(C12H6)]
method: RPBEPBE
basis: SDD
operation: Freq
keyword: #p
keyword: freq=noraman
keyword: PBEPBE/SDD
title: #p freq=noraman PBEPBE/SDD
converged: YES YES NO NO
title: Mulliken charges:
elementType: C C C C C C C C C C C C H H H H H H
charge: 0.319432 0.319422 0.319412 -0.536316 -0.536375 -0.536342 0.111135 0.111084 0.111027 -0.452048 -0.451974 -0.451950 0.274115 0.274161 0.274139 0.283700 0.283688 0.283687
chargesum: 0.00000
title: Mulliken charges with hydrogens summed into heavy atoms:
elementType: C C C C C C C C C C C C
charge: 0.319432 0.319422 0.319412 -0.262201 -0.262213 -0.262203 0.111135 0.111084 0.111027 -0.168348 -0.168286 -0.168263
polarizability: 1.86912841e+02 -1.91273664e-03 1.86837518e+02 -9.96316511e-04 4.17881492e-03 4.72525501e+01
1716.lowfreq: -5.8637 -0.0009 0.0002 0.0004 3.8377 6.6604 97.4688 102.6443 103.0188
frequency: 97.4687 102.6439 103.0187 158.3183 158.8011 183.1297 348.7247 349.0586 428.2139 438.6060 438.7650 467.7145 475.7147 475.8172 610.3582 619.2976 619.6422 629.4274 637.0033 637.4449 655.3224 655.7297 655.9175 695.0518 922.7772 923.9148 925.5494 934.8144 934.8549 979.2524 1160.5587 1161.1285 1286.3136 1297.5901 1361.4515 1410.2325 1410.4086 1584.1573 1584.4139 2136.0636 2136.1620 2139.1086 3167.9834 3168.4546 3171.8868 3427.2836 3428.6318 3429.2525
redmass: 4.7682 4.4019 4.4045 3.9804 3.9764 4.3568 4.3946 4.3980 7.0825 7.6029 7.5997 8.1935 7.5065 7.5095 5.9825 2.5860 2.6779 1.2638 1.7205 1.6813 1.2196 1.2234 1.2278 1.8813 1.4282 1.4276 1.8520 6.4364 6.4333 6.2090 1.5270 1.5303 1.2289 10.3463 8.3780 3.5532 3.5617 5.5406 5.5708 6.2269 6.2299 6.2409 1.0929 1.0930 1.0944 1.1571 1.1569 1.1571
irintensity: 2.2797 0.9542 0.9520 0.0000 0.0000 0.0000 0.0001 0.0000 3.8572 4.8143 4.8164 0.0000 1.3501 1.3595 0.0000 0.2269 0.0748 215.7955 0.4767 0.2102 40.7982 61.8226 85.2079 10.7105 3.0529 3.3589 63.1303 14.5396 14.5455 0.0000 0.1107 0.1190 0.0003 0.0000 0.0000 8.1637 8.1630 38.9689 38.8915 2.0162 2.0126 0.0011 0.9566 0.9612 0.0103 117.3669 132.6252 37.0369
temp: 298.150 k
press: 1.00000 atm
elementType: 6 6 6 6 6 6 6 6 6 6 6 6 1 1 1 1 1 1
symmnumber: 1
zpe: 327318.8 jmol-1
zpe.correction: 0.124669 hartree
zpe.thermalcorrener: 0.135599 hartree
zpe.thermalcorrenthalpy: 0.136543 hartree
zpe.thermalcorrgfe: 0.088207 hartree
zpe.sumelectzpe: -459.909540 hartree
zpe.sumelectthermal: -459.898611 hartree
zpe.sumelectthermalent: -459.897666 hartree
zpe.sumelectthermalfe: -459.946002 hartree
dipole: 0.0000 0.0007 0.0004
dipole: 0.0008
quadrupole: -56.7978 -56.8101 -73.4050
quadrupole: -0.0005 -0.0007 -0.0019
quadrupole: 5.5398 5.5275 -11.0673 -0.0005 -0.0007 -0.0019
hfenergy: -460.0342093 hartree
pointgroup: C01[X(C12H6)]
dipole: 0.0002507 -0.0000877 -0.0001543 debye
dipolederiv: 0.0668902 -0.0984772 0. -0.0992152 0.4840531 0.0000068 0.0000001 0.0000019 0.0742406 0.2941026 0.2303069 0.0000019 0.2298584 0.2570837 -0.0000004 0.0000065 0.0000049 0.0743203 0.4654271 -0.1306799 -0.0000161 -0.1311266 0.0856112 0.0000049 -0.0000211 0.0000063 0.0745413 -0.0847738 -0.0400288 0.0000008 -0.0399575 -0.2006497 -0.0000016 0.0000048 -0.0000006 -0.164551 -0.1370878 0.0699023 -0.0000018 0.0702643 -0.1487352 0.0000007 0.0000051 -0.0000103 -0.1644841 -0.2065169 -0.0304505 -0.0000034 -0.0302104 -0.0791868 0.0000017 0.0000107 0.0000066 -0.1646086 -0.1039867 -0.0630407 -0.0000032 -0.0629578 0.1589221 0.0000221 -0.0000216 0.0000943 -0.0196595 0.0386019 0.1453355 -0.0000166 0.1451893 0.0162059 -0.000019 -0.00009 -0.0000844 -0.0197345 0.147505 -0.0825138 -0.000019 -0.082272 -0.0927556 0.0000049 -0.0000645 0.0000188 -0.0197615 -0.2850637 0.0790184 0.0000077 0.07958 -0.6182688 -0.0000386 0.0000339 -0.0001537 -0.3099972 -0.4661487 -0.1842218 0.0000316 -0.1838693 -0.437191 0.0000309 0.0001466 0.0001369 -0.3099933 -0.6037419 0.1044845 0.0000302 0.104666 -0.2995206 -0.000009 0.0001147 -0.0000352 -0.3100022 -0.0203485 0.0376368 0.0000041 0.0377907 0.0891466 -0.0000017 0.0000056 -0.0000022 0.1577496 0.0292614 -0.0660959 0.0000033 -0.0663727 0.0396598 -0.0000004 0.0000046 0.0000002 0.1575962 0.0944334 0.0287184 0.0000033 0.0286163 -0.0258088 -0.0000044 0.0000037 -0.0000049 0.1575437 0.2522533 -0.0022761 -0.0000025 -0.002372 0.2620629 0.0000125 -0.000016 0.0000727 0.2622605 0.2575459 0.0054493 -0.000012 0.0054686 0.2567594 -0.0000116 -0.000072 -0.0000671 0.2622666 0.2616472 -0.0030676 -0.0000082 -0.0030801 0.2526117 0.0000024 -0.000051 0.0000158 0.2622732 unknown
polarizability: 186.8478249|0.0259566|186.9025342|-0.0034483|0.0025621|47.2525501 unknown
InChI: InChI=1S/C12H6/c1-4-10-7-11(5-2)9-12(6-3)8-10/h1-3,7-9H
charge 0 multiplicity 1
18 atoms
C  -0.31425 1.388965 -0.000081
C  -1.046018 -0.966455 -0.000104
C  1.359557 -0.422388 -0.000156
C  -1.353569 0.420501 -0.000076
C  1.040623 0.961959 -0.000124
C  0.312306 -1.382284 -0.000148
C  -0.630493 2.790609 -0.000054
C  -2.101571 -1.941351 -0.000103
C  2.731603 -0.849156 -0.000209
C  -0.900447 3.995187 -0.000057
C  -3.008833 -2.778454 -0.000137
C  3.910062 -1.216727 -0.000236
H  -2.398053 0.745075 -0.000048
H  1.843979 1.704126 -0.000138
H  0.553556 -2.449069 -0.000178
H  -1.135699 5.043665 -0.000223
H  -3.798678 -3.506984 -0.000383
H  4.935823 -1.536818 -0.000144
