program: Gaussian 09
title: 000139042
version: EM64L-G09RevD.01
frameworkgroup: C1[X(C14H9N2O)]
method: RPBEPBE
basis: SDD
operation: Freq
keyword: #p
keyword: freq=noraman
keyword: PBEPBE/SDD
title: #p freq=noraman PBEPBE/SDD
converged: NO YES NO YES
title: Mulliken charges:
elementType: O N N C C C C C C C C C C C C C C H H H H H H H H H
charge: -0.336860 -0.061476 0.098179 0.313038 0.286612 0.363601 0.318571 0.145523 -0.313899 -0.357639 -0.352561 -0.404185 -0.348098 -0.237933 -0.213721 -0.223732 -0.216146 0.252263 0.256159 0.250546 0.305360 0.265387 0.266851 0.266524 0.273193 0.404443
chargesum: 1.00000
title: Mulliken charges with hydrogens summed into heavy atoms:
elementType: O N N C C C C C C C C C C C C C C
charge: 0.067584 -0.061476 0.098179 0.313038 0.286612 0.363601 0.318571 0.145523 -0.313899 -0.105377 -0.096402 -0.153639 -0.042738 0.027454 0.053130 0.042791 0.057047
polarizability: 2.79411440e+02 -1.99805171e+01 2.25489141e+02 7.69023335e-03 -1.44044661e-02 5.95496766e+01
1716.lowfreq: -0.0010 -0.0005 0.0001 6.8307 6.8359 11.5344 54.4452 88.9748 112.8741
frequency: 54.4383 88.9668 112.8737 127.6130 147.5892 241.3411 247.5649 303.2657 309.0434 371.0140 375.4404 392.6649 410.3199 428.6153 430.2306 463.2732 466.6912 537.9947 563.4735 565.2857 611.8384 651.7908 652.6614 668.0633 732.6725 768.6134 775.1436 794.6662 819.7837 874.4912 890.1909 931.2343 970.1844 988.4870 990.7529 991.3934 1011.5906 1019.2475 1045.5982 1058.2292 1106.5418 1114.7992 1149.0160 1188.7835 1197.0163 1199.4163 1257.1313 1284.0427 1302.6849 1316.8725 1388.7428 1395.5802 1416.4683 1428.3305 1447.3972 1459.4847 1493.6784 1514.7324 1551.6301 1578.3677 1605.9549 1613.1617 2035.5948 3138.0196 3157.7126 3161.8927 3172.3629 3175.4602 3184.5480 3189.8056 3193.8320 3556.3151
redmass: 6.5918 4.1804 4.4503 10.9722 4.9590 4.9080 4.2618 5.2683 5.8830 1.2567 8.7772 6.9294 3.7489 2.9879 7.4959 9.1829 4.9338 4.3467 3.1915 6.2202 6.9951 6.8479 3.9945 6.3011 2.7569 6.1842 1.4171 1.5278 1.7204 4.8065 1.4100 2.7054 1.4377 7.1465 6.6340 1.3836 1.3927 1.3888 2.1288 2.1669 2.4162 2.7271 1.4642 1.3451 1.3684 1.1044 1.5682 4.1739 1.6103 2.3957 6.6585 3.8750 2.9775 3.5896 2.7409 3.0131 3.3742 3.4999 5.8874 6.7274 5.6224 6.0522 13.9224 1.0901 1.0885 1.0890 1.0922 1.0930 1.0971 1.0974 1.0993 1.0674
irintensity: 0.2504 0.5629 0.0199 0.4550 3.4790 0.2786 8.4030 16.0027 9.6097 143.1510 1.1345 3.7494 5.4965 0.1854 1.4416 9.1185 1.9439 0.1903 0.9798 0.6734 0.9909 9.3443 0.6105 8.0385 34.2377 4.0272 91.2995 57.4088 2.2750 6.3119 0.0032 0.1314 0.4476 21.0937 44.5227 1.7469 0.0031 0.1630 5.6498 7.9286 87.8282 52.9255 200.8869 4.1457 3.3410 1.7508 16.5485 53.4327 16.3874 10.9471 9.3995 19.4938 76.5264 16.4554 46.7324 72.5894 99.3092 102.5469 50.5537 31.7152 85.7378 112.4830 483.9949 2.4946 0.6608 1.1371 2.9745 0.5503 1.0489 3.0380 6.5180 109.4420
temp: 298.150 k
press: 1.00000 atm
elementType: 8 7 7 6 6 6 6 6 6 6 6 6 6 6 6 6 6 1 1 1 1 1 1 1 1 1
symmnumber: 1
zpe: 507573.8 jmol-1
zpe.correction: 0.193325 hartree
zpe.thermalcorrener: 0.206161 hartree
zpe.thermalcorrenthalpy: 0.207105 hartree
zpe.thermalcorrgfe: 0.154147 hartree
zpe.sumelectzpe: -722.209111 hartree
zpe.sumelectthermal: -722.196275 hartree
zpe.sumelectthermalent: -722.195330 hartree
zpe.sumelectthermalfe: -722.248289 hartree
dipole: -0.4746 1.8112 -0.0005
dipole: 1.8724
quadrupole: -55.4565 -55.5301 -99.6792
quadrupole: -3.3137 0.0019 -0.0052
quadrupole: 14.7654 14.6919 -29.4572 -3.3137 0.0019 -0.0052
hfenergy: -722.4024356 hartree
pointgroup: C01 [X(C14H9N2O1)]
dipole: -0.2253125 0.7013356 -0.0001803 debye
dipolederiv: -0.2511837 -0.2012574 0.0000763 -0.3979246 -1.4029108 0.0001034 0.0000586 0.0000265 -0.3418599 1.2857647 -1.2735774 0.0000632 -1.2565432 0.9394177 -0.0000374 0.0001204 -0.0001217 0.1473969 -0.6903948 0.7250046 -0.0000283 0.6660716 -0.6076301 0.000028 -0.0000778 0.0000909 0.0404398 -0.3705743 -0.1935 -0.0000002 0.0786695 -0.0053383 0.0000067 -0.0000274 -0.0000344 0.0344689 0.7225307 0.2707809 0.0000079 -0.4794216 0.3919568 -0.0000444 0.0001048 -0.0000246 0.0398424 0.1395561 0.2380179 -0.0000023 -0.2142343 0.1183635 -0.0000018 0.0000348 0.0000308 0.0230381 -0.4078478 0.6400367 -0.000067 0.3211218 -0.7622354 0.00008 -0.0000389 0.0001034 0.0152691 -1.01855 0.6214786 -0.0000467 0.6032047 -0.2133704 0.0000323 -0.0000623 0.000037 0.0480225 1.2823583 -0.522427 0.0000239 0.0677183 1.5254315 -0.0001579 0.0000066 -0.0001145 0.1486389 0.0435435 -0.1442727 0.0000137 0.0418625 0.0433117 -0.0000104 -0.0000081 -0.0000165 -0.1075973 -0.9553689 0.0204355 -0.0000316 0.1788876 0.1380571 -0.0000254 -0.0000537 -0.0000327 -0.117166 -0.0235678 -0.1578633 0.000019 -0.1740795 -0.1466481 -0.0000174 0.000016 -0.0000115 -0.141574 0.084736 -0.4902992 0.0000454 0.1647647 0.1511181 -0.0000231 -0.0000219 -0.0000326 -0.0820715 -0.2130372 0.0775419 -0.0000055 0.1241265 0.1933089 -0.0000182 -0.0000183 -0.0000206 -0.1078541 0.490202 0.0039416 0.0000227 0.1024429 0.3473831 -0.0000431 0.000015 -0.0000518 -0.0538408 0.1771938 0.0362629 0.0000139 -0.0173298 0.0476146 -0.0000049 0.0000215 -0.0000036 -0.1001596 0.2161567 0.1976022 -0.0000121 0.0158866 -0.526974 0.0000365 0.0000085 0.0000581 -0.1236344 0.0225518 0.0943398 -0.0000121 0.0500273 0.0561156 0.0000084 -0.0000047 0.0000161 0.1466651 0.098962 -0.0694769 0.0000071 -0.0214166 -0.0276436 0.0000214 -0.0000029 0.0000173 0.1498785 0.0584732 0.0370323 -0.0000107 0.1116239 -0.0118082 0.0000206 -0.0000154 0.0000152 0.1621938 0.1149173 0.0113689 -0.000001 -0.0207883 0.0447042 0.0000141 0.0000008 0.0000138 0.1624277 0.0873462 -0.0300096 -0.0000017 -0.0403551 -0.025419 0.0000127 -0.0000004 0.0000087 0.1648358 0.044379 0.0589928 -0.0000118 0.0694913 0.0461245 0.0000163 -0.0000125 0.0000154 0.1537263 -0.0166416 -0.0339921 -0.0000088 -0.0251805 0.0915334 0.0000039 -0.0000089 0.0000048 0.1651888 -0.0165945 -0.027843 -0.0000022 -0.0373498 0.0886468 0.0000087 -0.0000019 0.0000078 0.1691112 0.0950894 0.1116818 -0.0000512 0.088724 0.5068902 -0.0000093 -0.000032 0.0000186 0.4046137 unknown
polarizability: 281.4277825|-16.9242312|223.4727986|0.0084646|-0.0139635|59.5496766 unknown
InChI: InChI=1S/C14H9N2O/c15-16-13-11-7-3-1-5-9(11)10-6-2-4-8-12(10)14(13)17/h1-8,17H
charge 1 multiplicity 1
26 atoms
O  0.819827 2.959442 -0.000296
N  -1.92175 2.21289 -0.000183
N  -2.790618 2.998815 -0.00025
C  -0.348186 -1.154452 0.000057
C  1.064591 -0.74656 0.000086
C  -1.385629 -0.162986 -0.000071
C  1.427593 0.656543 -0.000059
C  -0.972715 1.247137 -0.000155
C  0.402927 1.654357 -0.000187
C  -0.747498 -2.523249 0.00014
C  2.128418 -1.689608 0.000241
C  -2.754803 -0.538595 -0.000122
C  2.803753 1.063779 -0.000069
C  -2.100984 -2.891476 0.000102
C  3.472208 -1.278045 0.000243
C  -3.111668 -1.896191 -0.000034
C  3.816549 0.104625 0.000079
H  0.006979 -3.313281 0.000229
H  1.915109 -2.760451 0.000365
H  -3.547879 0.21717 -0.000239
H  3.040496 2.130233 -0.00019
H  -2.378067 -3.949519 0.000168
H  4.265544 -2.032226 0.000368
H  -4.166999 -2.18363 -0.000079
H  4.866802 0.408801 0.000075
H  0.116099 3.657479 -0.000522
