program: Gaussian 09
title: 000139005
version: EM64L-G09RevD.01
frameworkgroup: C1[X(C14H14N2O2)]
method: RPBEPBE
basis: SDD
operation: Freq
keyword: #p
keyword: freq=noraman
keyword: PBEPBE/SDD
title: #p freq=noraman PBEPBE/SDD
converged: YES YES NO YES
title: Mulliken charges:
elementType: O O N N C C C C C C C C C C C C C C H H H H H H H H H H H H H H
charge: -0.214632 -0.214632 0.026477 -0.694956 -0.587223 -0.589980 0.535143 0.532078 -0.377816 -0.377804 -0.396985 -0.397064 -0.357904 -0.357907 -0.412560 -0.412539 0.366336 0.481794 0.229898 0.229903 0.223035 0.223031 0.245023 0.245024 0.225141 0.225147 0.283393 0.283397 0.214237 0.214240 0.304352 0.304352
chargesum: 0.00000
title: Mulliken charges with hydrogens summed into heavy atoms:
elementType: O O N N C C C C C C C C C C C C C C
charge: -0.214632 -0.214632 0.026477 -0.086252 -0.127421 -0.143913 0.535143 0.532078 -0.132793 -0.132780 -0.171844 -0.171917 -0.074511 -0.074510 -0.198323 -0.198300 0.366336 0.481794
polarizability: 3.48347140e+02 3.84534460e-04 1.70854447e+02 -1.94726567e+01 1.81741126e-03 8.12233241e+01
1716.lowfreq: -7.6618 -0.0010 -0.0007 0.0003 1.3241 4.7994 15.9675 21.9590 32.9887
frequency: 15.8440 21.9370 32.9886 38.8594 67.8624 74.1060 141.8765 174.5498 208.9167 289.0348 292.4184 341.7850 351.8114 362.0318 367.2996 386.5355 397.8379 408.6845 409.7558 473.7498 507.5383 518.4977 531.1669 626.6817 627.7654 639.3824 671.1982 717.8060 735.5338 750.4366 785.1146 786.9303 814.7905 816.8267 826.3417 840.6434 850.8666 873.0265 934.6812 952.0329 980.9913 982.7115 992.7457 994.3084 1000.6899 1005.7299 1021.0270 1094.1465 1096.4793 1125.9678 1147.8747 1179.6745 1187.8951 1216.6198 1222.0053 1223.4157 1263.9595 1265.8656 1302.1501 1313.1403 1314.9243 1320.9990 1361.9357 1386.6186 1403.3865 1419.0286 1434.9233 1473.0264 1480.2835 1487.4487 1520.6462 1582.3167 1594.4291 1606.5954 1633.1885 1645.1546 2984.8535 2999.0578 3034.7380 3064.6635 3106.6189 3108.4408 3129.7525 3135.1877 3136.6287 3138.0040 3181.3820 3183.7547 3568.6599 3708.8615
redmass: 4.0523 5.2816 6.5547 3.2542 7.2794 6.2308 7.1724 4.7139 4.6810 2.4399 5.7348 1.2299 2.8737 5.9148 1.0520 6.4081 2.5566 2.8875 2.6940 4.1977 6.9252 3.7244 2.6185 5.6437 6.8897 6.6119 4.7089 3.6683 4.0394 6.1066 1.1922 4.3399 2.5824 1.2600 4.3033 2.2228 1.2438 2.2668 1.4385 1.3592 1.9295 1.6560 2.2211 1.3726 2.8306 3.0295 1.4173 3.3580 1.2995 1.2161 1.1068 1.3322 1.1003 2.7131 2.5355 4.4829 1.2277 1.4566 1.2794 1.7689 2.0608 1.2564 7.6594 5.3927 8.6670 3.3092 3.2620 1.1779 2.2026 1.1008 3.1118 6.6501 7.6642 6.3279 2.1830 1.7892 1.0591 1.0596 1.1015 1.1049 1.0868 1.0867 1.0961 1.0904 1.0970 1.0907 1.0941 1.0952 1.0449 1.1040
irintensity: 0.0004 0.3778 0.1992 0.7311 0.0119 3.0912 1.8655 1.8075 1.9368 1.1728 6.1946 296.3160 1.2659 17.0948 0.0039 7.6860 0.7497 0.0041 0.0355 0.5890 0.8034 22.2530 26.9522 5.7629 0.3070 0.2225 28.7408 10.1990 1.9696 4.6967 0.3766 13.7492 22.6707 0.0068 12.5958 76.1068 0.0032 25.0861 2.3010 0.0487 19.3645 0.6464 14.6928 0.0638 0.0875 7.5352 0.0307 18.9291 16.0707 0.2620 24.2363 112.6712 44.0788 27.0786 113.8001 335.3936 0.8218 10.1623 0.1630 8.1467 110.0286 0.2707 99.1570 6.8760 1.1070 41.2168 0.5435 0.3424 11.1771 11.2350 134.4985 2.7767 2.5602 147.1426 4.6211 342.9133 11.2680 47.0517 2.0672 22.4334 1.2090 38.9971 45.7911 14.2142 6.6155 7.9060 0.0989 3.4359 98.4553 20.3701
temp: 298.150 k
press: 1.00000 atm
elementType: 8 8 7 7 6 6 6 6 6 6 6 6 6 6 6 6 6 6 1 1 1 1 1 1 1 1 1 1 1 1 1 1
symmnumber: 1
zpe: 660506.4 jmol-1
zpe.correction: 0.251574 hartree
zpe.thermalcorrener: 0.267825 hartree
zpe.thermalcorrenthalpy: 0.268769 hartree
zpe.thermalcorrgfe: 0.204352 hartree
zpe.sumelectzpe: -800.485567 hartree
zpe.sumelectthermal: -800.469316 hartree
zpe.sumelectthermalent: -800.468371 hartree
zpe.sumelectthermalfe: -800.532789 hartree
dipole: -8.7579 -0.0005 1.1487
dipole: 8.8329
quadrupole: -119.7787 -94.5064 -110.9145
quadrupole: -0.0038 -0.6546 -0.0015
quadrupole: -11.3788 13.8935 -2.5146 -0.0038 -0.6546 -0.0015
hfenergy: -800.7371405 hartree
pointgroup: C01 [X(C14H14N2O2)]
dipole: 3.443035 -0.0028114 0.4712603 debye
polarizability: 348.1201495|-0.1555918|170.8545434|20.9697012|-0.0788583|81.450218 unknown
InChI: InChI=1S/C14H14N2O2/c15-13-7-3-11(4-8-13)1-2-12-5-9-14(10-6-12)16(17)18/h3-10H,1-2,15H2
charge 0 multiplicity 1
32 atoms
O  -5.998053 1.14853 -0.322144
O  -6.000103 -1.13246 -0.320004
N  -5.398444 0.007589 -0.22023
N  6.848156 -0.003799 0.289755
C  0.342419 0.003262 0.719254
C  1.130838 0.001364 -0.636831
C  -1.15899 0.004427 0.50853
C  2.635657 0.0000 -0.426838
C  -1.87451 1.22622 0.382149
C  -1.876728 -1.216313 0.384352
C  3.362835 1.211728 -0.303134
C  3.360509 -1.213052 -0.3023
C  -3.261258 1.240201 0.14262
C  -3.263496 -1.228225 0.144845
C  4.751173 1.221517 -0.066536
C  4.748823 -1.225355 -0.065689
C  -3.93952 0.006499 0.026563
C  5.470478 -0.002566 0.058061
H  0.653176 0.89256 1.29861
H  0.651526 -0.885579 1.300194
H  0.821521 0.889268 -1.220994
H  0.819775 -0.886891 -1.219529
H  -1.335783 2.175738 0.480583
H  -1.339699 -2.166613 0.484507
H  2.834408 2.168927 -0.40204
H  2.830227 -2.169293 -0.400524
H  -3.824227 2.172475 0.048706
H  -3.828157 -2.159642 0.05263
H  5.286664 2.175517 0.016686
H  5.282487 -2.180318 0.018204
H  7.36121 -0.875842 0.375335
H  7.362886 0.867328 0.374607
