program: Gaussian 09
title: 000138987
version: EM64L-G09RevD.01
frameworkgroup: C1[X(C9H6O4)]
method: RPBEPBE
basis: SDD
operation: Freq
keyword: #p
keyword: freq=noraman
keyword: PBEPBE/SDD
title: #p freq=noraman PBEPBE/SDD
converged: NO NO NO NO
title: Mulliken charges:
elementType: O O O O C C C C C C C C C H H H H H H
charge: -0.243447 -0.246981 -0.191661 -0.169317 0.079986 0.310932 -0.432630 0.360394 0.085461 -0.206743 -0.753600 -0.289350 0.119874 0.281121 0.278721 0.259083 0.259052 0.238993 0.260114
chargesum: 0.00000
title: Mulliken charges with hydrogens summed into heavy atoms:
elementType: O O O O C C C C C C C C C
charge: -0.243447 -0.246981 -0.191661 -0.169317 0.079986 0.310932 -0.151510 0.360394 0.085461 0.071977 0.003528 -0.029236 0.119874
polarizability: 1.84197769e+02 5.81947678e-01 1.23498124e+02 -1.22279930e-03 6.51640413e-03 4.77402217e+01
1716.lowfreq: -10.7000 -0.0009 -0.0006 -0.0005 6.1499 7.2137 86.7684 88.6959 122.4539
frequency: 86.7670 88.6902 122.4538 156.0693 211.6559 232.3149 255.2882 290.0015 364.0781 409.2847 419.8734 463.2810 514.2191 540.7078 561.9260 632.0751 647.1523 665.7223 668.4927 695.2392 753.3615 813.5530 835.1473 838.3004 846.0425 937.7527 998.7136 1012.0481 1026.7276 1048.2385 1108.7832 1165.5342 1209.0652 1241.2705 1311.2946 1378.0037 1403.7729 1414.3633 1447.7738 1463.0220 1536.8942 1592.2083 1615.0266 1702.3693 1724.9440 2996.6933 3078.2540 3121.3332 3158.9271 3192.0127 3206.6900
redmass: 6.7852 3.7437 1.1465 6.6035 5.0176 6.2729 5.0660 4.3996 9.0346 7.6413 3.7988 6.6932 10.4720 5.7444 3.9173 9.5041 5.8067 4.3125 7.4264 8.8564 5.7057 5.4947 1.5673 1.3758 8.2436 6.2051 1.3033 1.6921 2.5739 1.5423 3.3006 2.6461 1.7972 1.6643 2.6721 4.3494 1.2980 2.5029 1.0434 1.1199 11.2337 6.9331 6.3303 12.4405 11.8022 1.0374 1.0971 1.0998 1.0904 1.0960 1.0942
irintensity: 4.9115 8.0323 0.0462 1.7030 3.1611 1.8835 0.0396 1.8632 1.4153 8.7119 0.0373 0.1254 0.4376 11.8121 1.0957 11.4702 5.5908 1.9527 4.9842 78.8088 22.0132 4.9582 44.9187 34.0057 73.2299 55.5276 0.1094 31.1683 20.6494 12.6112 25.1471 13.1598 11.3064 7.7006 79.5685 2.9893 20.2530 9.9338 16.9641 33.5494 346.5405 23.5941 262.9330 753.9701 338.0106 4.8149 5.1706 10.1971 2.5110 0.3639 2.4684
temp: 298.150 k
press: 1.00000 atm
elementType: 8 8 8 8 6 6 6 6 6 6 6 6 6 1 1 1 1 1 1
symmnumber: 1
zpe: 342152.4 jmol-1
zpe.correction: 0.130319 hartree
zpe.thermalcorrener: 0.141075 hartree
zpe.thermalcorrenthalpy: 0.142019 hartree
zpe.thermalcorrgfe: 0.093721 hartree
zpe.sumelectzpe: -646.538427 hartree
zpe.sumelectthermal: -646.527672 hartree
zpe.sumelectthermalent: -646.526728 hartree
zpe.sumelectthermalfe: -646.575025 hartree
dipole: 2.7775 -1.4704 -0.0107
dipole: 3.1427
quadrupole: -79.1148 -79.0167 -73.6174
quadrupole: -23.3924 0.0262 0.0069
quadrupole: -1.8652 -1.7671 3.6322 -23.3924 0.0262 0.0069
hfenergy: -646.6687464 hartree
pointgroup: C01 [X(C9H6O4)]
dipole: 1.071355 0.6171755 0.0042235 debye
dipolederiv: -0.4970965 -0.4660212 -0.0002151 0.1424654 -1.0513493 -0.0003547 0.0006 0.0003913 -0.196904 -1.4029544 0.2138582 -0.0011567 -0.1906819 -0.319771 -0.0007475 0.0020462 0.0002869 -0.2070794 -0.4907485 0.2746319 -0.0000581 0.4269485 -1.3276282 0.0002266 0.0010657 -0.0020712 -0.3201238 -1.3415701 0.3494335 0.0020132 0.67333 -0.5969751 -0.0013124 -0.0069645 0.0027499 -0.3131072 -0.8051513 0.3979218 0.0005366 -0.4982064 -0.7462013 0.0002627 -0.0009162 -0.0000173 -0.080599 1.0832475 -0.012832 0.0000823 0.3937285 0.8238623 -0.0004176 0.0003404 0.0003235 0.2356739 -1.1576309 -0.3282566 0.0002788 -0.0814216 -0.1608074 0.0000602 0.0009486 -0.0003753 -0.2335135 1.1430233 0.2132236 -0.000446 -0.3738725 0.6073394 0.0001222 -0.000788 -0.0003543 0.1041614 0.9827366 -0.1912719 0.0000186 -0.5011803 1.9286157 0.0001651 -0.0016915 0.0017456 0.2768829 0.9464611 -0.0765037 -0.0010155 0.2737273 0.2081962 0.0003642 0.0010575 -0.000195 -0.017125 -0.3534088 -0.1955092 0.0002383 -0.0303381 -0.0190799 0.0000069 0.0002128 0.0003568 0.022323 -0.6058942 0.1457896 0.0009776 0.7136974 -0.3486459 0.0002696 0.0007741 -0.0003038 -0.2015321 2.106564 -0.3819467 -0.001085 -0.7898521 0.8651564 0.0019057 0.0029492 -0.0016978 0.2842643 0.0992084 0.0018168 0.0000173 -0.0272809 0.013824 0.0000228 -0.0000255 0.0000436 0.1865618 0.1222538 0.0442331 -0.0000302 -0.0278591 0.0097061 -0.0003144 0.0006874 -0.0000522 0.1448625 0.0436082 -0.0052724 0.0662334 -0.0285839 0.0798847 -0.0613001 0.1029232 -0.0306978 0.0024317 0.0432868 -0.0051797 -0.0663201 -0.0285588 0.0799103 0.0613273 -0.1030519 0.0306758 0.0025934 0.0698615 0.0728774 0.0000294 -0.0149244 -0.0971125 0.000007 -0.0000003 -0.0000426 0.1250558 0.0142034 -0.0509926 -0.0000988 -0.0311372 0.0510755 -0.0002937 -0.0001673 -0.0007659 0.1851732 unknown
polarizability: 184.1617744|1.5881454|123.5341182|0.0009891|0.006556|47.7402217 unknown
InChI: InChI=1S/C9H6O4/c1-5-4-7-6(9(11)12-5)2-3-8(10)13-7/h2-4H,1H3
charge 0 multiplicity 1
19 atoms
O  2.381595 -0.405838 -0.000735
O  -1.440889 1.256006 0.000736
O  1.543642 -2.568536 -0.001903
O  -3.761278 1.114002 -0.003644
C  -0.067611 -0.744686 0.000777
C  -0.202176 0.659521 0.000487
C  0.933962 1.529199 -0.000017
C  2.197613 0.970261 -0.000696
C  1.252357 -1.362041 0.00065
C  -1.255575 -1.555948 -0.000015
C  3.495095 1.720298 -0.001623
C  -2.513984 -0.985275 0.000446
C  -2.714527 0.454112 0.004642
H  0.795957 2.610522 -0.000152
H  -1.134192 -2.644197 -0.001652
H  4.094311 1.451439 -0.890255
H  4.095499 1.451532 0.886234
H  3.321553 2.807383 -0.001559
H  -3.421551 -1.593354 -0.001722
