program: Gaussian 09
title: 000011505
version: EM64L-G09RevD.01
frameworkgroup: C1[X(C8H10O)]
method: RPBEPBE
basis: SDD
operation: Freq
keyword: #pfreq=noraman
keyword: PBEPBE/SDD
title: #p freq=noraman PBEPBE/SDD
converged: YES YES NO NO
title: Mulliken charges:
elementType: O C C C C C C C C H H H H H H H H H H
charge: -0.443033 0.362332 0.439837 -0.412701 -0.352089 -0.400900 -0.350960 -0.435527 -0.804656 0.229791 0.260920 0.229622 0.229047 0.195354 0.230698 0.228418 0.223835 0.233428 0.336584
chargesum: 0.00000
title: Mulliken charges with hydrogens summed into heavy atoms:
elementType: O C C C C C C C C
charge: -0.106449 0.362332 0.439837 -0.182910 -0.091169 -0.171278 -0.121913 -0.009475 -0.118975
polarizability: 1.19228340e+02 -1.63283747e+00 8.97118157e+01 4.12106077e+00 1.66003035e+00 5.06132742e+01
1716.lowfreq: -13.0651 -0.0007 -0.0006 0.0006 3.5853 10.7789 28.8575 43.9495 113.3783
frequency: 27.8889 43.9124 113.3676 199.9888 273.0870 338.5865 359.9689 396.2905 405.5686 473.4453 546.4196 636.4896 707.7508 735.2652 807.2268 824.4533 851.1798 937.6540 958.1055 969.5026 976.5434 994.6414 1014.6795 1047.9527 1121.1188 1157.1237 1187.9236 1216.1751 1222.2990 1286.4920 1315.6946 1361.6079 1384.1648 1398.6077 1406.3227 1467.7210 1470.9539 1475.3643 1507.6504 1585.5856 1625.2545 2956.8636 2975.6161 3048.6976 3054.6426 3084.6279 3110.7369 3116.8864 3135.4298 3148.0690 3555.1852
redmass: 1.0498 3.2986 3.1919 3.7423 2.1915 2.9644 1.5758 2.5877 2.8249 2.8301 3.7874 6.8758 3.3243 3.2846 1.9785 2.4601 1.2486 1.5242 2.8112 1.5635 1.4481 1.5453 2.7512 1.5562 1.3078 1.1058 1.1343 3.9576 2.3443 1.3324 1.2758 1.5193 2.6537 1.2701 2.7033 1.0938 1.0520 1.0949 2.6647 6.0439 6.3699 1.0675 1.0378 1.0950 1.0966 1.0990 1.0871 1.0883 1.0962 1.0960 1.0661
irintensity: 0.8293 2.6538 0.7823 3.3411 21.1955 14.2854 108.9079 46.7734 0.6598 25.2429 16.8659 0.2577 3.4578 8.8739 41.4718 17.0834 0.6131 33.2630 58.8762 1.1188 1.0338 2.0270 2.4318 14.4559 14.2839 17.7756 2.9518 11.4643 0.8192 5.3558 7.3048 27.9665 12.3511 9.7124 3.6911 5.8634 12.7025 17.2220 18.7514 0.6608 4.8353 67.1905 34.0701 20.8411 22.9795 19.4250 12.3360 16.9176 31.2700 5.7272 5.1936
temp: 298.150 k
press: 1.00000 atm
elementType: 8 6 6 6 6 6 6 6 6 1 1 1 1 1 1 1 1 1 1
symmnumber: 1
zpe: 412812.0 jmol-1
zpe.correction: 0.157232 hartree
zpe.thermalcorrener: 0.166307 hartree
zpe.thermalcorrenthalpy: 0.167252 hartree
zpe.thermalcorrgfe: 0.121895 hartree
zpe.sumelectzpe: -385.395930 hartree
zpe.sumelectthermal: -385.386855 hartree
zpe.sumelectthermalent: -385.385911 hartree
zpe.sumelectthermalfe: -385.431267 hartree
dipole: 2.0326 0.9060 0.7213
dipole: 2.3394
quadrupole: -57.2830 -49.8539 -53.9074
quadrupole: -4.3349 -0.8089 0.0022
quadrupole: -3.6016 3.8276 -0.2260 -4.3349 -0.8089 0.0022
hfenergy: -385.5531621 hartree
pointgroup: C01 [X(C8H10O1)]
dipole: -0.7726668 0.467042 -0.1788495 debye
dipolederiv: -0.8206232 -0.0394505 0.2030146 -0.0435636 -0.4254933 -0.1840659 0.3034669 -0.201353 -0.4151105 -0.0330678 -0.0033507 0.0646081 -0.0358847 -0.0948569 -0.0481237 0.0901998 -0.0216071 -0.1051661 0.3858857 0.0243433 0.0608328 0.0497735 -0.0468263 -0.0047415 0.1064596 -0.0007905 -0.0217048 -0.0434909 0.0337906 0.025817 0.0314669 0.0652321 0.0629692 0.0447431 0.0596955 -0.1392355 -0.0639991 -0.0446984 0.0066723 -0.0495086 0.0440198 0.0221902 -0.0519636 0.0204807 -0.1566163 -0.1486721 -0.0645932 -0.0001341 -0.1648608 0.0537229 0.0232378 -0.0504673 0.0364925 -0.1611843 -0.1495043 0.0504931 0.0132859 0.1254171 0.0804515 0.0725352 0.0292342 0.0675015 -0.1557353 0.5831006 -0.0182805 -0.1255179 0.0177452 0.3882705 0.1204752 -0.2166436 0.1294609 0.4657401 -0.1333502 -0.0191191 -0.0326159 -0.0719713 0.0773472 -0.0045642 -0.1059496 -0.0047586 0.0575641 0.0236146 -0.1015416 -0.0315563 -0.0865138 -0.0597885 -0.0511652 -0.0227473 -0.0516144 0.1370541 0.0524134 0.0858172 0.0002965 0.0791397 -0.0169727 -0.0232168 -0.0019862 -0.0260033 0.1479902 -0.0038775 0.1125796 0.011223 0.1029052 -0.0502906 -0.0292277 0.0068014 -0.0292825 0.1476482 0.022109 -0.0966096 -0.0290706 -0.0921089 -0.0626221 -0.0524099 -0.0216293 -0.0538572 0.1330346 0.0004387 -0.0124536 0.0300293 -0.1011102 -0.2077587 -0.0741304 0.0222385 -0.0324846 0.0362062 -0.0458391 0.0210501 -0.0495172 0.0907308 0.0493118 0.087859 -0.0281258 0.0359166 -0.0823574 -0.0103498 -0.0404794 0.0236936 -0.0990737 -0.0437668 0.1021606 0.0778327 0.0880795 0.0531959 0.0181744 0.0368922 0.0105588 0.1385445 -0.0821889 -0.069664 0.0546837 -0.0681689 0.0835044 -0.0108792 -0.0036183 -0.0430937 -0.000775 0.1075627 -0.0375936 -0.1052076 -0.0272216 -0.1182898 0.3779167 0.0792288 -0.1385262 0.1096479 0.2246464 0.0874758 -0.1309396 0.0795144 0.0934623 unknown
polarizability: 119.039339|-1.5124917|87.4499527|5.7497832|9.1039535|53.064138 unknown
InChI: InChI=1S/C8H10O/c1-7-2-4-8(6-9)5-3-7/h2-5,9H,6H2,1H3
charge 0 multiplicity 1
19 atoms
O  3.257984 -0.627436 -0.551487
C  1.01612 0.120926 0.266813
C  -1.831769 0.028056 -0.061194
C  0.231294 1.289397 0.414157
C  0.362821 -1.09757 -0.055349
C  -1.173576 1.241479 0.258577
C  -1.037109 -1.140133 -0.215879
C  2.525078 0.162616 0.455921
C  -3.338054 -0.025429 -0.25206
H  0.71761 2.243403 0.655229
H  0.963917 -2.005846 -0.17691
H  -1.763803 2.157852 0.381013
H  -1.525102 -2.091793 -0.461866
H  2.877107 1.216154 0.467611
H  2.823358 -0.305709 1.410726
H  -3.785461 -0.870603 0.30259
H  -3.823442 0.903194 0.094544
H  -3.601791 -0.161374 -1.318708
H  2.963217 -0.337685 -1.452329
