program: Gaussian 09
title: 000011504
version: EM64L-G09RevD.01
frameworkgroup: C1[X(C8H11N)]
method: RPBEPBE
basis: SDD
operation: Freq
keyword: #pfreq=noraman
keyword: PBEPBE/SDD
title: #p freq=noraman PBEPBE/SDD
converged: YES YES NO YES
title: Mulliken charges:
elementType: N C C C C C C C C H H H H H H H H H H H
charge: -0.698823 0.501536 -0.534673 -0.392500 -0.392541 0.480652 -0.671237 -0.409875 -0.409866 0.203987 0.203987 0.223622 0.223621 0.219792 0.210432 0.219790 0.210488 0.210488 0.300560 0.300560
chargesum: 0.00000
title: Mulliken charges with hydrogens summed into heavy atoms:
elementType: N C C C C C C C C
charge: -0.097703 0.501536 -0.126699 -0.168877 -0.168920 0.480652 -0.021223 -0.199387 -0.199379
polarizability: 1.33641753e+02 7.18175709e-04 9.25459316e+01 -6.96610253e+00 2.20822769e-03 5.20422715e+01
1716.lowfreq: -8.2207 0.0001 0.0003 0.0003 6.0837 14.8839 41.1535 97.6784 210.6656
frequency: 38.0584 97.6771 210.6638 215.8735 308.7076 311.6426 356.6479 384.1993 395.2480 409.7194 467.4012 539.3192 639.3600 715.0604 735.3951 783.5587 815.7692 822.0701 825.7003 933.1044 950.4048 966.7377 1001.7968 1007.3623 1053.5556 1062.7110 1132.8427 1187.5311 1218.8347 1243.1567 1308.7272 1314.9929 1319.9699 1385.0670 1387.5870 1432.2991 1470.7134 1473.0761 1488.3907 1519.9978 1583.1839 1632.2592 1643.9160 2973.5468 2979.5884 3029.1573 3070.5252 3079.5812 3104.0087 3105.6721 3126.5533 3133.6659 3570.3365 3711.2726
redmass: 2.4589 3.6352 1.1585 3.4550 1.9906 1.2227 1.0494 4.9408 2.4046 2.6760 4.1642 2.2685 6.5973 3.6367 3.1327 1.1678 1.2599 1.9622 4.0437 1.3658 1.3596 2.3941 2.6745 1.4849 1.3457 2.0396 1.2045 1.0952 2.2429 1.2622 2.4945 1.7565 1.2610 5.4674 1.2014 3.1710 1.0437 1.0641 1.0855 3.0430 6.6463 1.8672 2.0759 1.0360 1.0589 1.1014 1.0997 1.1010 1.0866 1.0864 1.0962 1.0971 1.0447 1.1040
irintensity: 0.1756 3.6499 0.4385 2.4742 1.8952 322.5076 0.0025 2.7158 1.0163 0.0106 2.3804 26.4162 0.1249 4.7930 2.6264 3.0398 0.0578 70.1719 12.4254 0.2681 0.0188 4.4723 0.0002 0.0173 2.0168 13.6645 18.0181 13.7640 0.3217 1.2213 47.6637 24.4120 0.3634 11.7139 9.4417 0.2977 13.0026 1.3961 7.4173 131.5236 3.8116 1.5058 255.5471 47.7917 45.0615 10.8935 67.7931 42.9884 0.5589 39.5670 58.1002 1.5904 59.6814 18.7450
temp: 298.150 k
press: 1.00000 atm
elementType: 7 6 6 6 6 6 6 6 6 1 1 1 1 1 1 1 1 1 1 1
symmnumber: 1
zpe: 446650.9 jmol-1
zpe.correction: 0.170120 hartree
zpe.thermalcorrener: 0.179251 hartree
zpe.thermalcorrenthalpy: 0.180195 hartree
zpe.thermalcorrgfe: 0.135983 hartree
zpe.sumelectzpe: -365.536150 hartree
zpe.sumelectthermal: -365.527019 hartree
zpe.sumelectthermalent: -365.526075 hartree
zpe.sumelectthermalfe: -365.570287 hartree
dipole: -1.7805 -0.0002 0.3163
dipole: 1.8084
quadrupole: -41.0240 -48.7298 -59.9959
quadrupole: 0.0006 -2.6311 0.0009
quadrupole: 8.8926 1.1868 -10.0794 0.0006 -2.6311 0.0009
hfenergy: -365.7062704 hartree
pointgroup: C01 [X(C8H11N1)]
dipole: -0.7005595 -0.0000796 0.1241369 debye
dipolederiv: -1.5818255 -0.0001133 0.0875144 -0.000123 -0.084433 0.0000833 0.1171197 0.0000857 -0.778328 0.0992549 0.0000118 -0.0010776 -0.0000096 -0.278402 0.0000021 0.0208439 -0.0000016 -0.138322 0.1165029 0.0000179 -0.0234864 0.0000877 0.1523814 0.0000134 -0.145854 0.0000094 0.1361592 0.126605 0.1538625 -0.0463534 -0.038586 0.1709226 0.0074024 -0.0382031 -0.0289963 -0.136015 0.126633 -0.15386 -0.0463924 0.038579 0.1709049 -0.0073407 -0.0382015 0.0290665 -0.1360178 1.625713 0.0001413 -0.194132 0.0001478 -0.0640744 -0.0000375 -0.2228727 -0.0000416 0.1637392 -0.0349096 0.0000142 -0.0471802 -0.0000041 0.0781984 0.0000395 0.0251865 0.000041 -0.0124473 -0.378765 -0.0923549 0.0067557 0.3844747 0.0688164 -0.0426366 0.0166335 0.0166811 -0.232999 -0.3787348 0.0922922 0.0067624 -0.3845472 0.0687694 0.0427148 0.0165508 -0.0166068 -0.232986 -0.0134973 0.0203026 0.0174141 0.0915061 -0.0784301 -0.1418484 0.0373761 -0.0885483 -0.0229246 -0.0134313 -0.0202931 0.0173633 -0.0915314 -0.0786304 0.1418061 0.03728 0.0885111 -0.0227393 0.0285093 0.1115457 0.0247545 0.1031738 -0.0711096 -0.0127143 0.0214069 -0.0157483 0.1340826 0.0285355 -0.1115434 0.0247279 -0.1031576 -0.0711466 0.01267 0.0213794 0.0157068 0.1340936 0.0918874 0.0731539 0.0340801 0.029829 -0.0746297 -0.1279592 0.0104558 -0.0814268 -0.0076485 -0.3007809 -0.0000122 -0.0008627 -0.0000088 0.1046315 0.0000171 -0.0073612 0.0000165 0.0605976 0.0918871 -0.0731757 0.0340166 -0.0298405 -0.0748064 0.1279031 0.010438 0.0813673 -0.0074703 -0.0198624 -0.1166021 0.0242187 -0.1052581 -0.0782043 0.0117268 0.0298033 0.0140815 0.1640445 -0.0198948 0.1166062 0.0242503 0.1052597 -0.0781661 -0.0117838 0.0298331 -0.0141391 0.1640391 0.2030881 -0.009473 0.0288125 -0.0211281 0.1087014 0.0010066 0.0290884 0.0003524 0.3855707 0.2030854 0.0094794 0.0288142 0.0211366 0.1087066 -0.0010647 0.0290973 -0.0004104 0.3855712 unknown
polarizability: 133.647791|0.001856|92.5459314|-6.930647|0.0037338|52.036234 unknown
InChI: InChI=1S/C8H11N/c1-2-7-3-5-8(9)6-4-7/h3-6H,2,9H2,1H3
charge 0 multiplicity 1
20 atoms
N  -3.237971 -0.00025 0.303773
C  0.993236 0.000135 -0.330037
C  2.505396 0.000258 -0.510091
C  0.263132 -1.211278 -0.220535
C  0.262953 1.211413 -0.220249
C  -1.853571 -0.000124 0.099383
C  3.271469 -0.000269 0.840107
C  -1.130639 -1.222781 -0.010314
C  -1.130818 1.222663 -0.010019
H  2.813594 -0.887238 -1.09672
H  2.813524 0.888257 -1.095991
H  0.795606 -2.167698 -0.305435
H  0.795291 2.16793 -0.304919
H  3.010719 0.891152 1.439639
H  4.366021 -0.000166 0.678493
H  3.010784 -0.892196 1.438915
H  -1.666159 -2.17792 0.064328
H  -1.666478 2.177705 0.064862
H  -3.752108 0.871634 0.381551
H  -3.751982 -0.872225 0.381357
