program: Gaussian 09
title: 000138941
version: EM64L-G09RevD.01
frameworkgroup: C1[X(C10H12N2)]
method: RPBEPBE
basis: SDD
operation: Freq
keyword: #pfreq=noraman
keyword: PBEPBE/SDD
title: #p freq=noraman PBEPBE/SDD
converged: NO YES NO YES
title: Mulliken charges:
elementType: N N C C C C C C C C C C H H H H H H H H H H H H
charge: -0.158929 -0.158930 -0.462559 -0.462567 -0.462568 -0.462557 0.266879 0.266880 -0.396656 -0.396657 -0.225919 -0.225924 0.254878 0.221785 0.221787 0.254881 0.221787 0.254881 0.254879 0.221786 0.260099 0.260100 0.226320 0.226322
chargesum: 0.00000
title: Mulliken charges with hydrogens summed into heavy atoms:
elementType: N N C C C C C C C C C C
charge: -0.158929 -0.158930 0.014105 0.014101 0.014100 0.014108 0.266879 0.266880 -0.136557 -0.136557 0.000402 0.000398
polarizability: 1.41864014e+02 -7.83083346e-05 1.09395257e+02 -3.70838339e-03 -1.44184925e-04 7.96748170e+01
1716.lowfreq: -7.4419 -0.0009 -0.0008 0.0002 19.8039 32.9327 124.5000 126.0109 183.3424
frequency: 124.4073 125.2130 183.3384 292.7049 360.5536 370.7280 375.4347 500.8341 525.9844 529.3462 532.5023 586.8963 619.8835 725.4362 741.2142 771.4364 785.2401 791.4167 800.9376 806.2777 870.0346 871.5347 891.6233 937.8534 956.0427 967.1597 974.1660 991.2547 1009.5804 1021.5519 1069.2154 1095.7405 1126.1311 1153.9095 1169.2339 1193.3656 1203.8898 1226.8266 1257.1295 1290.1550 1290.2928 1291.7431 1293.7914 1308.6301 1309.4590 1380.6735 1444.7165 1451.7935 1452.2492 1461.6835 1464.0992 1472.5970 1590.5775 1613.3009 3000.1070 3000.5853 3011.0393 3013.9888 3066.8056 3069.3271 3088.3386 3094.3637 3125.6222 3139.4302 3151.6924 3163.7512
redmass: 3.6581 2.3399 2.3456 1.9477 2.8887 3.3936 3.2326 4.5327 3.2339 4.4945 4.4047 10.0148 3.6779 5.4429 5.9449 1.2420 4.7293 3.4915 1.2631 1.5527 3.8062 2.7624 1.4495 4.1276 1.4478 4.6878 2.5027 1.3182 2.0038 4.2206 2.8238 3.3674 1.5653 1.2485 1.9258 1.7877 1.2226 1.1084 1.4327 1.1649 1.2140 1.4629 1.2454 1.4838 1.2794 7.0087 2.2901 1.0798 2.8483 1.0761 1.1100 1.1184 6.9011 7.5674 1.0605 1.0600 1.0610 1.0625 1.1040 1.1050 1.1063 1.1074 1.0853 1.0901 1.0953 1.1004
irintensity: 3.6348 0.0000 0.0000 1.6796 0.0816 2.0589 0.0284 0.0000 20.6405 0.1356 1.4033 0.5602 0.0000 1.9640 37.7519 73.9058 1.1468 0.0000 0.2469 24.3286 1.1398 2.4967 0.0000 10.3195 0.3200 0.8345 0.0000 0.0000 11.5255 31.7595 6.4746 0.0000 1.4875 7.3450 0.0018 21.9103 1.1979 0.0000 0.9410 5.8325 0.1571 1.7456 0.0000 2.7419 2.4415 0.0069 1.5949 0.0000 41.3401 16.1005 10.4443 22.5350 1.5618 0.0667 57.9345 0.0019 77.9222 102.4645 0.0000 0.7656 38.6698 57.8860 1.0408 8.6700 21.4038 26.5265
temp: 298.150 k
press: 1.00000 atm
elementType: 7 7 6 6 6 6 6 6 6 6 6 6 1 1 1 1 1 1 1 1 1 1 1 1
symmnumber: 1
zpe: 529807.2 jmol-1
zpe.correction: 0.201793 hartree
zpe.thermalcorrener: 0.210548 hartree
zpe.thermalcorrenthalpy: 0.211493 hartree
zpe.thermalcorrgfe: 0.168279 hartree
zpe.sumelectzpe: -496.845109 hartree
zpe.sumelectthermal: -496.836353 hartree
zpe.sumelectthermalent: -496.835409 hartree
zpe.sumelectthermalfe: -496.878623 hartree
dipole: -0.6311 0.0000 0.0000
dipole: 0.6311
quadrupole: -61.6131 -75.2246 -69.7806
quadrupole: 0.0000 -0.0005 0.0001
quadrupole: 7.2597 -6.3518 -0.9078 0.0000 -0.0005 0.0001
hfenergy: -497.0469017 hartree
pointgroup: C01 [X(C10H12N2)]
dipole: -0.2482776 0.0000027 0.0000066 debye
dipolederiv: -0.5302656 -0.0592026 0.0000026 -0.0019091 -0.4821966 -0.000004 0.0000151 0.0000051 -0.3584316 -0.5302646 0.0592039 0.0000131 0.0019088 -0.4821984 0.0000019 -0.0000044 -0.0000023 -0.3584315 0.1733343 0.0119187 0.0586023 0.0157623 0.1535875 0.0066557 0.1309858 -0.0213925 0.2408044 0.1733036 0.0119171 -0.0585875 0.0157555 0.1535881 -0.0066499 -0.1309803 0.0213898 0.2408179 0.173323 -0.0119175 0.0585968 -0.0157597 0.1535885 -0.0066553 0.1309887 0.0213864 0.2408019 0.1733119 -0.0119203 -0.0585921 -0.0157599 0.1535887 0.0066545 -0.1309762 -0.0213879 0.2408201 0.4958134 -0.0378016 -0.0000353 -0.2248562 0.0719408 0.0000102 -0.0000338 -0.0000019 -0.0899672 0.4958202 0.0377907 -0.0000269 0.2248458 0.0719325 -0.0000139 -0.0000249 0.0000005 -0.0899673 -0.1373828 0.0196853 0.0000001 0.0023588 0.1011136 -0.0000033 -0.000001 -0.0000025 -0.1291697 -0.1373822 -0.0196793 -0.000001 -0.0023533 0.1011125 0.0000011 -0.0000021 0.0000029 -0.1291699 0.0581251 0.0649488 -0.0000139 0.0712785 -0.0105446 -0.0000053 -0.0000131 -0.0000052 -0.1629979 0.0581162 -0.0649491 -0.0000147 -0.0712773 -0.0105425 0.0000032 -0.0000149 0.0000026 -0.1629996 0.0734448 -0.0577113 0.1036183 -0.0157813 0.0113691 0.0585681 0.0479002 0.061526 -0.1046839 -0.1884312 0.1067437 -0.052753 0.0636157 0.0187081 0.0091958 0.00596 -0.0190552 0.0797278 -0.1884246 0.1067522 0.0527946 0.0636266 0.0187014 -0.0092107 -0.0059171 0.019039 0.0797231 0.0734204 -0.0577222 -0.103647 -0.0157928 0.0113717 -0.0585585 -0.0479347 -0.0615126 -0.1046521 -0.1884325 -0.1067441 -0.0527656 -0.0636211 0.0187065 -0.0092022 0.0059476 0.0190504 0.0797284 0.0734389 0.0577136 0.1036263 0.0157845 0.0113708 -0.0585614 0.0479133 -0.0615208 -0.1046703 0.0734309 0.0577163 -0.1036356 0.0157859 0.0113674 0.0585692 -0.0479172 0.0615202 -0.1046647 -0.1884297 -0.1067399 0.052781 -0.0636083 0.0187133 0.0092008 -0.0059332 -0.0190442 0.0797226 0.0939743 0.0165692 0.0000029 -0.0280091 -0.0803317 0.0000038 0.0000051 0.0000014 0.1507254 0.0939744 -0.0165733 0.0000036 0.0280044 -0.0803311 -0.0000012 0.0000048 -0.0000006 0.150726 -0.0969132 -0.0903443 0.0000159 -0.0964446 0.0326939 0.0000068 0.0000157 0.0000063 0.1581035 -0.096905 0.0903462 0.000015 0.0964457 0.0326904 -0.0000053 0.0000167 -0.000005 0.1581046 unknown
polarizability: 141.8640136|-0.0005128|109.3952566|-0.0037084|-0.0001441|79.674817 unknown
InChI: InChI=1S/C10H12N2/c1-2-4-10-9(3-1)11-5-7-12(10)8-6-11/h1-4H,5-8H2
charge 0 multiplicity 1
24 atoms
N  -1.021818 1.309406 0.000122
N  -1.02185 -1.309402 0.000134
C  -1.75165 0.792259 -1.219354
C  -1.751498 0.79227 1.2197
C  -1.751645 -0.792249 -1.219362
C  -1.751544 -0.792237 1.219692
C  0.318906 0.710002 0.000055
C  0.318889 -0.710032 0.00007
C  1.522308 1.433549 -0.000023
C  1.52227 -1.433613 -0.000001
C  2.741861 0.70823 -0.00009
C  2.741847 -0.708325 -0.000078
H  -1.247705 1.19405 -2.11385
H  -2.779037 1.198704 -1.187026
H  -2.778876 1.198755 1.187533
H  -1.2474 1.19404 2.114119
H  -2.779029 -1.198704 -1.187082
H  -1.247653 -1.194026 -2.113837
H  -1.247513 -1.194042 2.114132
H  -2.778945 -1.198653 1.187469
H  1.501799 2.528551 -0.000033
H  1.501735 -2.528613 -0.000002
H  3.69459 1.249959 -0.000152
H  3.69456 -1.250078 -0.000135
