program: Gaussian 09
title: 000138936
version: EM64L-G09RevD.01
frameworkgroup: C1[X(C8H11N)]
method: RPBEPBE
basis: SDD
operation: Freq
keyword: #pfreq=noraman
keyword: PBEPBE/SDD
title: #p freq=noraman PBEPBE/SDD
converged: YES YES NO NO
title: Mulliken charges:
elementType: N C C C C C C C C H H H H H H H H H H H
charge: -0.274945 -0.044933 -0.248628 -0.459162 -0.412436 -0.322531 -0.235091 -0.251958 -0.230826 0.200211 0.241359 0.202514 0.240030 0.223400 0.216116 0.276951 0.248958 0.204367 0.223076 0.203529
chargesum: 0.00000
title: Mulliken charges with hydrogens summed into heavy atoms:
elementType: N C C C C C C C C
charge: 0.002006 0.155277 -0.007269 -0.016617 0.027080 -0.073573 -0.030724 -0.028883 -0.027297
polarizability: 1.05674692e+02 3.45799544e+00 9.96989822e+01 1.07492257e+00 -2.68189141e+00 6.20956135e+01
1716.lowfreq: -23.4075 -14.6239 -0.0010 -0.0008 -0.0006 19.0447 224.1474 257.9760 309.8426
frequency: 224.1264 257.9639 309.8393 345.2962 436.1596 507.7920 514.5372 593.4243 620.1176 664.6834 726.2508 743.6798 761.3144 803.2541 842.8358 861.1403 868.5457 889.1018 919.3556 933.0151 957.3813 980.2954 1027.7298 1063.6716 1081.5208 1108.3505 1132.5531 1160.9283 1187.5158 1209.9604 1216.8605 1235.6589 1259.3174 1278.7256 1323.0415 1334.4026 1374.0009 1391.1647 1444.1130 1449.5079 1459.9220 1517.4965 1596.3879 2655.7169 3011.3865 3022.8079 3031.7044 3072.7363 3084.7832 3108.9274 3111.6740 3130.4902 3157.8407 3418.9894
redmass: 2.0530 2.9385 2.6609 2.3040 4.5214 3.3464 4.0192 3.1212 3.0906 1.6343 2.0271 3.4452 1.9805 2.2836 2.6347 2.4477 2.2431 3.4855 1.6333 1.9577 1.2884 2.2551 2.0418 2.9022 1.7866 1.1712 1.1529 1.3116 1.3058 1.4928 1.2643 1.3020 1.3815 1.5491 1.2141 1.2369 1.4136 1.8747 1.3782 2.6112 1.1147 3.7974 1.0908 1.0728 1.0623 1.0778 1.0651 1.0864 1.1052 1.0903 1.1071 1.0886 1.1002 1.0749
irintensity: 0.0514 1.4046 0.4356 10.3602 2.4141 2.4113 5.7204 6.9913 29.0021 35.1537 24.4488 8.3487 43.8435 48.1361 5.0681 64.7591 13.0269 3.2359 0.6919 14.3080 0.8795 16.0388 1.8328 7.3794 22.0317 3.4904 5.2685 1.1676 1.0483 2.8099 5.7130 0.4665 3.7122 2.9214 12.2036 10.2184 1.2448 1.3005 4.8815 9.2624 4.3051 0.4477 0.2824 22.9873 19.6499 55.0517 56.2012 20.2009 12.3532 31.5364 45.4724 14.6502 32.1714 1.9806
temp: 298.150 k
press: 1.00000 atm
elementType: 7 6 6 6 6 6 6 6 6 1 1 1 1 1 1 1 1 1 1 1
symmnumber: 1
zpe: 451111.8 jmol-1
zpe.correction: 0.171819 hartree
zpe.thermalcorrener: 0.178674 hartree
zpe.thermalcorrenthalpy: 0.179618 hartree
zpe.thermalcorrgfe: 0.141178 hartree
zpe.sumelectzpe: -365.392205 hartree
zpe.sumelectthermal: -365.385351 hartree
zpe.sumelectthermalent: -365.384406 hartree
zpe.sumelectthermalfe: -365.422847 hartree
dipole: -0.4463 0.7902 -0.9037
dipole: 1.2807
quadrupole: -51.7582 -51.6004 -57.9596
quadrupole: 1.4082 -1.8003 0.7654
quadrupole: 2.0145 2.1723 -4.1869 1.4082 -1.8003 0.7654
hfenergy: -365.5640242 hartree
pointgroup: C01 [X(C8H11N1)]
dipole: -0.2000488 0.3063113 -0.3464637 debye
dipolederiv: -0.4399224 0.0340781 -0.1547289 0.0777946 -0.3330977 0.0417623 -0.1438329 0.0130397 -0.6508804 0.157859 -0.1674608 -0.0497472 -0.2094265 -0.0148841 0.0745032 0.1238378 0.0813794 0.3317697 0.2649521 0.1063274 0.0567122 0.0202418 0.2260445 0.0012522 0.0385293 0.0734592 0.2142259 0.0372863 -0.1054132 0.0728148 -0.1033598 0.0814214 0.008034 -0.021396 0.0091547 0.1865602 0.0807897 0.0501027 0.0538829 0.068429 0.0352469 -0.0297216 -0.0012206 -0.0520397 0.1382712 0.230217 0.0401318 0.0702035 0.1203029 -0.0393171 -0.0244015 0.0478518 -0.0093436 -0.2319682 0.1950578 -0.004822 0.112349 -0.1458205 0.073308 -0.1337472 0.163913 -0.0182165 -0.2299917 0.0000975 0.0872154 -0.0342954 0.2185882 -0.0196805 0.0571309 -0.0694888 -0.0534485 -0.2384452 -0.2222821 -0.0202716 -0.018027 -0.135862 0.0428481 -0.1151151 0.1085109 -0.0957058 -0.1697553 -0.0533638 -0.0005195 -0.0413609 0.034565 0.0433145 0.0998433 -0.082878 0.0312507 -0.0592133 0.0137038 -0.0612009 -0.0492541 -0.0215025 -0.0746545 -0.0951443 -0.0577986 -0.125114 0.0056898 0.0537071 0.023646 0.0188981 0.0459845 0.0223231 -0.0796584 0.0772977 -0.118653 -0.1369942 -0.0641912 0.086698 -0.0486066 0.0859204 -0.0106036 0.0409844 -0.10324 0.0884653 0.0018827 -0.1634625 -0.0702231 -0.0493636 -0.0453102 0.0494125 -0.0249517 -0.1008224 -0.0357001 0.0408518 0.0669627 0.0267538 -0.0195663 -0.0221634 0.0021803 0.0670223 0.0523851 0.0885924 -0.1231347 -0.0056166 0.0076471 0.184309 0.0251389 0.0894351 -0.0655135 0.0852681 -0.0488432 0.2964731 0.0399427 -0.0658882 -0.0000947 -0.0869491 -0.0827715 -0.0046477 -0.0140558 0.0329392 0.1913267 0.0375868 0.0149738 -0.0429091 0.0310956 -0.1540205 0.1090275 -0.0333291 0.0695198 0.1214721 -0.1427137 -0.0701101 0.0044897 -0.0305936 0.0603642 0.0154093 -0.0195174 0.0141464 0.1577476 -0.0866101 0.0883351 -0.0657053 0.0729267 0.0031307 0.0579318 -0.0500141 0.0551172 0.1541122 unknown
polarizability: 105.3003274|3.7103435|100.1843285|0.3945508|-2.0623307|61.9846318 unknown
InChI: InChI=1S/C8H11N/c1-2-4-8-6-5-7(3-1)9-8/h1-4,7-9H,5-6H2
charge 0 multiplicity 1
20 atoms
N  0.483638 -0.092033 1.176822
C  0.282556 -0.949241 -0.057002
C  0.830436 1.132741 0.435179
C  1.7602 -1.051371 -0.496399
C  2.029191 0.536666 -0.449671
C  -1.083156 -1.571128 -0.022997
C  -0.494538 1.564185 -0.276666
C  -2.043446 -0.558526 -0.071153
C  -1.723303 0.876929 -0.280156
H  0.007751 -0.239553 -0.892814
H  1.187541 1.957324 1.079451
H  1.896295 -1.453265 -1.51553
H  2.402228 -1.588228 0.218659
H  2.993842 0.763707 0.035107
H  2.032001 0.96515 -1.468429
H  -0.383598 0.008148 1.72668
H  -1.337081 -2.635994 -0.021501
H  -0.521567 2.598421 -0.656293
H  -3.109378 -0.816973 -0.053915
H  -2.588513 1.475339 -0.598071
